Boranamine, b,b-di-tert-butyl-N,N-dimethyl-

Gas phase ion energetics data

Data compiled by: Sharon G. Lias, John E. Bartmess, Joel F. Liebman, John L. Holmes, Rhoda D. Levin, and W. Gary Mallard

Ionization energy determinations

IE (eV) Method Reference Comment
8.45PENoth and Prigge, 1986Vertical value

References

Noth and Prigge, 1986
Noth, H.; Prigge, H., Kernresonanz- und He(I)-photoelektronenspektroskopische untersuchung an diisopropyl- und di-tert-butylboranen, Chem. Ber., 1986, 119, 338. [all data]