Tetrahydrofuran-3-carbaldehyde

Condensed phase thermochemistry data

Data compiled by: Hussein Y. Afeefy, Joel F. Liebman, and Stephen E. Stein

Quantity Value Units Method Reference Comment
Δfliquid-301.6kJ/molCmSlivinsky, Dolidze, et al., 1993

References

Slivinsky, Dolidze, et al., 1993
Slivinsky, E.V.; Dolidze, A.V.; Loktev, S.M., Hydroformylation of 2,3- and 2,5-dihydrofurans in the presence of a homogeneous catalytic complex based on dicarbonylrhodium acetylacetonate modified with various phosphites, Neftekhimiya, 1993, 33, 102-113. [all data]