tert-Butyl glycidyl ether

Gas phase thermochemistry data

Data compiled as indicated in comments:
DRB - Donald R. Burgess, Jr.
ALS - Hussein Y. Afeefy, Joel F. Liebman, and Stephen E. Stein

Quantity Value Units Method Reference Comment
Δfgas-318.8 ± 1.1kJ/molN/ASlivinsky, Dolidze, et al., 1993Value computed using ΔfHliquid° value of -369±1 kj/mol from Slivinsky, Dolidze, et al., 1993 and ΔvapH° value of 50.22±0.35 kj/mol from missing citation.; DRB
Δfgas-319.7 ± 2.7kJ/molCcbVan-Chin-Syan and Kachurina, 1987ALS
Δfgas-322. ± 2.kJ/molCcbZaikin, Wang, et al., 1975Heat of combustion is not reported; ALS
Δfgas-319.8 ± 3.0kJ/molN/AZaikin, Van-Chin-Syan, et al., 1973Value computed using ΔfHliquid° value of -370±3 kj/mol from Zaikin, Van-Chin-Syan, et al., 1973 and ΔvapH° value of 50.22±0.35 kj/mol from missing citation.; DRB
Δfgas-318.8 ± 1.1kJ/molN/AZaikin, Van Chin Syan, et al., 1972Value computed using ΔfHliquid° value of -369±1 kj/mol from Zaikin, Van Chin Syan, et al., 1972 and ΔvapH° value of 50.22±0.35 kj/mol from missing citation.; DRB

References

Slivinsky, Dolidze, et al., 1993
Slivinsky, E.V.; Dolidze, A.V.; Loktev, S.M., Hydroformylation of 2,3- and 2,5-dihydrofurans in the presence of a homogeneous catalytic complex based on dicarbonylrhodium acetylacetonate modified with various phosphites, Neftekhimiya, 1993, 33, 102-113. [all data]

Van-Chin-Syan and Kachurina, 1987
Van-Chin-Syan, Yu.Ya.; Kachurina, N.S., Thermochemical properties of oxirane derivatives, Russ. J. Phys. Chem. (Engl. Transl.), 1987, 61, 622-624. [all data]

Zaikin, Wang, et al., 1975
Zaikin, I.D.; Wang, C-H.; Chuchmarev, S.K., The dissociation energy of the peroxide bond in dialkyl peroxides, Russ. J. Phys. Chem. (Engl. Transl.), 1975, 49, 1818-1819. [all data]

Zaikin, Van-Chin-Syan, et al., 1973
Zaikin, I.D.; Van-Chin-Syan, Yu.Ya.; Chuchmarev, S.K.; Elagin, G.I., Standard heats of formation of certain t-alkyl glycidyl ethers, Russ. J. Phys. Chem. (Engl. Transl.), 1973, 47, 925. [all data]

Zaikin, Van Chin Syan, et al., 1972
Zaikin, I.; Van Chin Syan, Y.Y.; Chuchmarev, S.K.; Elagin, G.I., Normal heats of formation of some epoxy compounds, Izv. Vyssh. Uchebn. Zaved., Khim. Khim. Tekhnol., 1972, 15, 1193-1195. [all data]