4-Methyl-2,6,7-trioxabicyclo[2.2.2]octane

Gas phase thermochemistry data

Data compiled by: Hussein Y. Afeefy, Joel F. Liebman, and Stephen E. Stein

Quantity Value Units Method Reference Comment
Δfgas-506.8 ± 1.2kJ/molCcbRakus, Verevkin, et al., 1995

References

Rakus, Verevkin, et al., 1995
Rakus, K.; Verevkin, S.P.; Peng, W.-H.; Beckhaus, H.D.; Ruchardt, C., The anomeric effect in orthoesters - the concept of geminal pairwise interactions for the interpretation of standard enthalpies of formation, Liebigs Ann., 1995, 2059-2067. [all data]