cyclohexyl hydroperoxide

Condensed phase thermochemistry data

Data compiled by: Hussein Y. Afeefy, Joel F. Liebman, and Stephen E. Stein

Quantity Value Units Method Reference Comment
Δcliquid-3803. ± 3.kJ/molCcbPritzkow and Muller, 1956Corresponding Δfliquid = -273. kJ/mol (simple calculation by NIST; no Washburn corrections)

Gas phase thermochemistry data

Data compiled by: Hussein Y. Afeefy, Joel F. Liebman, and Stephen E. Stein

Quantity Value Units Method Reference Comment
Δfgas-214.9kJ/molEqkKhursan and Martem'yanov, 1991hf from V. P.Komissarov's report

References

Pritzkow and Muller, 1956
Pritzkow, W.; Muller, K.A., Uber die energetische stellung der organischen hydroperoxyde und die o-o-bindungsenergie, Chem. Ber., 1956, 89, 2318-2321. [all data]