Pyrrole, 2,5-dimethyl-N-amino-

Gas phase ion energetics data

Data compiled by: Sharon G. Lias and Joel F. Liebman

Ionization energy determinations

IE (eV) Method Reference Comment
7.44PEZverev, 1992Vertical value

References

Zverev, 1992
Zverev, V.V., Electronic structure and conformation of N-amino-2,5-dimethylpyrrole derivatives and N-formylaniline, Izv. Akad. Nauk SSSR, Ser. Khim., 1992, 3, 602. [all data]