2,2,3,3-Tetrafluoro-1-propanol

Kovats' RI, non-polar column, isothermal

View large format table.

Column type Active phase Temperature (C) I Reference Comment
CapillaryPermaphase DMS160.651.Boneva and Kotov, 199250. m/0.25 mm/1.0 μm
CapillaryPermaphase DMS170.640.Boneva and Kotov, 199250. m/0.25 mm/1.0 μm
CapillaryPermaphase DMS180.636.Boneva and Kotov, 199250. m/0.25 mm/1.0 μm

Condensed phase thermochemistry data

Data compiled by: Hussein Y. Afeefy, Joel F. Liebman, and Stephen E. Stein

Quantity Value Units Method Reference Comment
Δfliquid-266.47 ± 0.19kcal/molCcbKolesov, Ivanov, et al., 1969Reanalyzed by Pedley, Naylor, et al., 1986, Original value = -263.27 ± 0.16 kcal/mol; hf298_gas[kcal/mol]=-254.49±0.64; Kolesov and Kozina, 1986
Quantity Value Units Method Reference Comment
Δcliquid-323.46 ± 0.16kcal/molCcbKolesov, Ivanov, et al., 1969hf298_gas[kcal/mol]=-254.49±0.64; Kolesov and Kozina, 1986

Phase change data

Data compiled as indicated in comments:
BS - Robert L. Brown and Stephen E. Stein
ALS - Hussein Y. Afeefy, Joel F. Liebman, and Stephen E. Stein
AC - William E. Acree, Jr., James S. Chickos

Quantity Value Units Method Reference Comment
Tboil382. - 383.KN/APCR Inc., 1990BS
Tboil382.7KN/AWeast and Grasselli, 1989BS
Quantity Value Units Method Reference Comment
Δvap12.81kcal/molVRochester and Symonds, 1973ALS
Δvap12.8kcal/molMMRochester and Symonds, 1973Based on data from 298. - 333. K.; AC

Enthalpy of vaporization

ΔvapH (kcal/mol) Temperature (K) Method Reference Comment
11.4318.AStephenson and Malanowski, 1987Based on data from 303. - 380. K.; AC
12.0313.MMRochester and Symonds, 1973Based on data from 298. - 333. K.; AC

Henry's Law data

Data compiled by: Rolf Sander

Henry's Law constant (water solution)

kH(T) = H exp(d(ln(kH))/d(1/T) ((1/T) - 1/(298.15 K)))
H = Henry's law constant for solubility in water at 298.15 K (mol/(kg*bar))
d(ln(kH))/d(1/T) = Temperature dependence constant (K)

H (mol/(kg*bar)) d(ln(kH))/d(1/T) (K) Method Reference
160.6700.MN/A

Gas phase ion energetics data

Data compiled by: Sharon G. Lias and Joel F. Liebman

Ionization energy determinations

IE (eV) Method Reference Comment
11.58PEZverev, Sinyashina, et al., 1990Vertical value

References

Boneva and Kotov, 1992
Boneva, S.; Kotov, St., Capillary gas chromatography of some telomeric fluoroalkanols, Chromatographia, 1992, 34, 9/10, 475-478, https://doi.org/10.1007/BF02290239 . [all data]