3-Buten-2-one, 4-(2-iodophenyl)-

Gas phase ion energetics data

Data compiled as indicated in comments:
LLK - Sharon G. Lias, Rhoda D. Levin, and Sherif A. Kafafi

Ionization energy determinations

IE (eV) Method Reference Comment
8.6 ± 0.05EISchaldach, Grotemeyer, et al., 1981LLK
8.3EIGrutzmacher, Schaldach, et al., 1980LLK

Appearance energy determinations

Ion AE (eV) Other Products MethodReferenceComment
C10H9O+8.8IEIGrutzmacher, Schaldach, et al., 1980LLK

References

Schaldach, Grotemeyer, et al., 1981
Schaldach, B.; Grotemeyer, B.; Grotemeyer, J.; Grutzmacher, H.-F., Kinetic and thermodynamic effects on intramolecular aromatic substitution in meta and para substituted benzalacetones, Org. Mass Spectrom., 1981, 16, 410. [all data]

Grutzmacher, Schaldach, et al., 1980
Grutzmacher, H.-F.; Schaldach, B.; Schubert, R.; Ramana, D.V., Ion kinetic energy release as a transition state probe in intramolecular aromatic substitutions, Adv. Mass Spectrom., 1980, 8, 795. [all data]