4-Propionyl-4'-n-nonanoyloxyazobenzene

Phase change data

Data compiled by: Eugene S. Domalski and Elizabeth D. Hearing

Enthalpy of fusion

ΔfusH (kJ/mol) Temperature (K) Reference Comment
3.017367.15Fanelli, Poeti, et al., 1983Solid-smectic A.

Entropy of fusion

ΔfusS (J/mol*K) Temperature (K) Reference Comment
8.22367.15Fanelli, Poeti, et al., 1983Solid-smectic

Enthalpy of phase transition

ΔHtrs (kJ/mol) Temperature (K) Initial Phase Final Phase Reference Comment
0.042353.25liquid, Hexaticliquid, monotropic smectic BFanelli, Poeti, et al., 1983
1.757361.05liquid, Smectic Aliquid, monotropic hexaticFanelli, Poeti, et al., 1983
7.029417.15liquid, Smectic Aliquid, isotropicFanelli, Poeti, et al., 1983

References

Fanelli, Poeti, et al., 1983
Fanelli, E.; Poeti, G.; Braghetti, M., Calorimetric study of 4-propionyl-4'-n-alkanoyloxyazobenzene series, Mol. Cryst. Liq. Cryst., 1983, 92, 127-134. [all data]