Benzenamine,2,6-dimethyl-N-[(3-methylphenyl)methylene]-4-nitro-

Gas phase ion energetics data

Data compiled by: Sharon G. Lias, Rhoda D. Levin, and Sherif A. Kafafi

Ionization energy determinations

IE (eV) Method Reference Comment
8.43PEAkaba, Tokumaru, et al., 1980Vertical value

References

Akaba, Tokumaru, et al., 1980
Akaba, R.; Tokumaru, K.; Kobayashi, T.; Utsunomiya, C., Electronic structures conformations of N-benzylideneanilines. II. Photoelectron spectral study, Bull. Chem. Soc. Jpn., 1980, 53, 2002. [all data]