tert-amyl methanoate

Phase change data

Data compiled by: Thermodynamics Research Center, NIST Boulder Laboratories, Chris Muzny director

Quantity Value Units Method Reference Comment
Tboil385.25KN/AYoung and Pare, 1958Uncertainty assigned by TRC = 1. K
Tboil386.1KN/ABarkenbus, Naff, et al., 1954Uncertainty assigned by TRC = 1. K

In addition to the Thermodynamics Research Center (TRC) data available from this site, much more physical and chemical property data is available from the following TRC products:

References

Young and Pare, 1958
Young, D.; Pare, E., J. Org. Chem., 1958, 23, 1772. [all data]

Barkenbus, Naff, et al., 1954
Barkenbus, C.; Naff, M.B.; Rapp, K.E., The Preparation and Properties of Some tert-Alkyl Formates, J. Org. Chem., 1954, 19, 1316. [all data]