Butane, 1-(methylsulfonyl)-

Phase change data

Data compiled as indicated in comments:
TRC - Thermodynamics Research Center, NIST Boulder Laboratories, Chris Muzny director
ALS - Hussein Y. Afeefy, Joel F. Liebman, and Stephen E. Stein

Quantity Value Units Method Reference Comment
Tfus297.KN/AMackle and O'Hare, 1961Uncertainty assigned by TRC = 1. K; TRC
Tfus303.KN/AYamamoto, 1952Uncertainty assigned by TRC = 3. K; TRC
Tfus303.KN/AChallenger, Taylor, et al., 1942Uncertainty assigned by TRC = 2. K; TRC
Quantity Value Units Method Reference Comment
Δvap76. ± 2.kJ/molVMackle and O'Hare, 1961Heat of combustion corrected for constant pressure; ALS

In addition to the Thermodynamics Research Center (TRC) data available from this site, much more physical and chemical property data is available from the following TRC products:

Gas phase thermochemistry data

Data compiled by: Hussein Y. Afeefy, Joel F. Liebman, and Stephen E. Stein

Quantity Value Units Method Reference Comment
Δfgas-109.87 ± 0.63kcal/molCcbMackle and O'Hare, 1961Reanalyzed by Cox and Pilcher, 1970, Original value = -109.5 ± 0.5 kcal/mol; Heat of combustion corrected for constant pressure

References

Mackle and O'Hare, 1961
Mackle, H.; O'Hare, P.A.G., Studies in the thermochemistry of sulphones. Part 5.-Heats of combustion, formation, fusion, vaporization and atomization of eleven aliphatic sulphones, Trans. Faraday Soc., 1961, 57, 1070-1074. [all data]

Yamamoto, 1952
Yamamoto, Y., Synthesis and Antobacterial Activity of 2-Amino-2-methyl-5-thiazolyl Alkyl Sulfides and Sulfones, J. Pharm. Soc. Jpn., 1952, 7, 1124-8. [all data]

Challenger, Taylor, et al., 1942
Challenger, F.; Taylor, P.; Taylor, B., Interaction of Betaine with Primary Aromatic Amines, Organic Disulfides, and Sodium Sulfate, J. Chem. Soc., 1942, 48-55. [all data]