N-(Diphenylcarbamoyl)piperidine

Condensed phase thermochemistry data

Data compiled by: Hussein Y. Afeefy, Joel F. Liebman, and Stephen E. Stein

Quantity Value Units Method Reference Comment
Δfsolid-108. ± 10.kJ/molCcbTavernier and Lamouroux, 1956Reanalyzed by Cox and Pilcher, 1970, Original value = -91.84 kJ/mol; Author's hf298_condensed=-30.748 kcal/mol
Quantity Value Units Method Reference Comment
Δcsolid-9833. ± 10.kJ/molCcbTavernier and Lamouroux, 1956Reanalyzed by Cox and Pilcher, 1970, Original value = -9849.688 kJ/mol; Author's hf298_condensed=-30.748 kcal/mol

References

Tavernier and Lamouroux, 1956
Tavernier, P.; Lamouroux, M., Determinations calorimetriques relatives a vingt-six substances organiques, Mem. Poudres, 1956, 38, 65-88. [all data]

Cox and Pilcher, 1970
Cox, J.D.; Pilcher, G., Thermochemistry of Organic and Organometallic Compounds, Academic Press, New York, 1970, 1-636. [all data]