Trifluorogermane, methyl-

Gas phase ion energetics data

Data compiled by: Sharon G. Lias, Rhoda D. Levin, and Sherif A. Kafafi

Ionization energy determinations

IE (eV) Method Reference Comment
12.5PEDrake, Glavincevski, et al., 1979
12.50PEDrake, Glavincevski, et al., 1979Vertical value

References

Drake, Glavincevski, et al., 1979
Drake, J.E.; Glavincevski, B.M.; Gorzelska, K., The photoelectron spectra of methylgermane, trifluoro- and trichloro-methylgermane, J. Electron Spectrosc. Relat. Phenom., 1979, 17, 73. [all data]