trans-Perfluorobicyclo[4,3.0]nonane

Phase change data

Data compiled as indicated in comments:
AC - William E. Acree, Jr., James S. Chickos
ALS - Hussein Y. Afeefy, Joel F. Liebman, and Stephen E. Stein

Quantity Value Units Method Reference Comment
Δvap10.8 ± 0.02kcal/molCVarushchenko, Druzhinina, et al., 1996AC
Δvap9.70 ± 0.02kcal/molEZhogina, Papina, et al., 1989ALS

Enthalpy of fusion

ΔfusH (kcal/mol) Temperature (K) Method Reference Comment
0.629248.1ACVarushchenko and Druzhinina, 1998Based on data from 5. - 350. K.; AC

Condensed phase thermochemistry data

Data compiled by: Hussein Y. Afeefy, Joel F. Liebman, and Stephen E. Stein

Quantity Value Units Method Reference Comment
Δfliquid-778.6 ± 1.2kcal/molCcrZhogina, Papina, et al., 1989
Quantity Value Units Method Reference Comment
Δcliquid-752.3 ± 1.2kcal/molCcrZhogina, Papina, et al., 1989

References

Varushchenko, Druzhinina, et al., 1996
Varushchenko, Raisa M.; Druzhinina, Anna I.; Pashchenko, Larisa L., Thermodynamics of vaporization of some cyclic perfluorocarbons, Fluid Phase Equilibria, 1996, 126, 1, 93-104, https://doi.org/10.1016/S0378-3812(96)03111-1 . [all data]

Zhogina, Papina, et al., 1989
Zhogina, E.V.; Papina, T.S.; Kolesov, V.P.; Prokudin, I.P.; Asovich, V.S.; Mel'nichenko, V.A., Standard enthalpy of formation of trans-perfluorobicyclo-[4,3,0]-nonane, Russ. J. Phys. Chem. (Engl. Transl.), 1989, 63, 747-748. [all data]

Varushchenko and Druzhinina, 1998
Varushchenko, R.M.; Druzhinina, A.I., Low-temperature calorimetric studies ofcis- andtrans-perfluorobicyclo(4,3,0)nonanes, The Journal of Chemical Thermodynamics, 1998, 30, 6, 697-708, https://doi.org/10.1006/jcht.1997.0336 . [all data]