methylmagnesium bromide

Reaction thermochemistry data

Data compiled by: José A. Martinho Simões

Individual Reactions

Hydrogen bromide (g) + CH3BrMg (solution) = Methane (solution) + Br2Mg (solution)

By formula: HBr (g) + CH3BrMg (solution) = CH4 (solution) + Br2Mg (solution)

Quantity Value Units Method Reference Comment
Δr-65.61 ± 0.53kcal/molRSCHolm, 1981solvent: Diethyl ether; The enthalpy of formation was calculated using the assumptions and the auxiliary data in Holm, 1981, except for the organic compound, whose enthalpy of formation was quoted from Pedley, 1994

magnesium (cr) + Methane, bromo- (l) = CH3BrMg (solution)

By formula: Mg (cr) + CH3Br (l) = CH3BrMg (solution)

Quantity Value Units Method Reference Comment
Δr-64.0 ± 1.1kcal/molRSCHolm, 1981solvent: Diethyl ether; Due to the possibility of side reactions, the enthalpy of reaction was not considered to be sufficiently reliable for deriving the enthalpy of formation of the Grignard reagent Holm, 1981

C5H11BrMg (solution) + Methane (solution) = Pentane (solution) + CH3BrMg (solution)

By formula: C5H11BrMg (solution) + CH4 (solution) = C5H12 (solution) + CH3BrMg (solution)

Quantity Value Units Method Reference Comment
Δr-3.6 ± 1.0kcal/molRSCHolm, 1983solvent: Diethyl ether

References

Holm, 1981
Holm, T., J. Chem. Soc., Perkin Trans. II, 1981, 464.. [all data]

Pedley, 1994
Pedley, J.B., Thermodynamic Data and Structures of Organic Compounds; Thermodynamics Research Center Data Series, Vol I, Thermodynamics Research Center, College Station, 1994. [all data]

Holm, 1983
Holm, T., Acta Chem. Scand. B, 1983, 37, 797. [all data]