N,N-Diphenyl-4-morpholinecarboxamide

Condensed phase thermochemistry data

Data compiled by: Hussein Y. Afeefy, Joel F. Liebman, and Stephen E. Stein

Quantity Value Units Method Reference Comment
Δfsolid-217.6 ± 5.9kJ/molCcbTavernier and Lamouroux, 1955Reanalyzed by Cox and Pilcher, 1970, Original value = -203.5 kJ/mol; Author's hf289_condensed=-56.92 kcal/mol
Quantity Value Units Method Reference Comment
Δcsolid-9044.6 ± 5.9kJ/molCcbTavernier and Lamouroux, 1955Reanalyzed by Cox and Pilcher, 1970, Original value = -9058.69 kJ/mol; Author's hf289_condensed=-56.92 kcal/mol

References

Tavernier and Lamouroux, 1955
Tavernier, P.; Lamouroux, M., Determinations calorimetriques relatives a douze substances organiques susceptibles d'utilisation dans les poudres, Mem. Poudres, 1955, 37, 197-206. [all data]

Cox and Pilcher, 1970
Cox, J.D.; Pilcher, G., Thermochemistry of Organic and Organometallic Compounds, Academic Press, New York, 1970, 1-636. [all data]