Bicyclo[2.2.1]heptan-2-ol, 1,7,7-trimethyl-, formate, endo-

Kovats' RI, polar column, temperature ramp

Data compiled by: NIST Mass Spectrometry Data Center, William E. Wallace, director

Column type CapillaryCapillary
Active phase DB-WaxDB-Wax
Column length (m) 30.30.
Carrier gas H2
Substrate
Column diameter (mm) 0.250.25
Phase thickness (μm) 0.250.25
Tstart (C) 40.40.
Tend (C) 260.240.
Heat rate (K/min) 4.2.
Initial hold (min) 2.
Final hold (min) 15.40.
I 1592.1543.
ReferenceAvato, Raffo, et al., 2004Nébié, Yaméogo, et al., 2004
Comment MSDC-RI MSDC-RI

References

Avato, Raffo, et al., 2004
Avato, P.; Raffo, F.; Aldouri, N.A.; Vartanian, S.T., Essential oils of varthemia iphionoides from Jordan, Flavour Fragr. J., 2004, 19, 6, 559-561, https://doi.org/10.1002/ffj.1351 . [all data]

Nébié, Yaméogo, et al., 2004
Nébié, R.H.C.; Yaméogo, R.T.; Bélanger, A.; Sib, F.S., Composition chimique des huiles essentielles d'Ageratum conyzoïdes du Burkina Faso, C.R. Chim., 2004, 7, 10-11, 1019-1022, https://doi.org/10.1016/j.crci.2003.12.027 . [all data]