Carbamic acid, 4-methoxyphenyl, ethyl ester

Kovats' RI, non-polar column, isothermal

View large format table.

Column type Active phase Temperature (C) I Reference Comment
PackedSE-30140.1632.Gerqasimenko and Voskoboinikov, 1987Column length: 1. m
PackedSE-30140.1639.Gerqasimenko and Voskoboinikov, 1987Column length: 1. m
PackedSE-30160.1636.Gerqasimenko and Voskoboinikov, 1987Column length: 1. m

References

Gerqasimenko and Voskoboinikov, 1987
Gerqasimenko, V.A.; Voskoboinikov, V.V., Thermostability and gas chromatographic retention of substituted alkylarlcarbmates, Zh. Anal. Khim., 1987, 62, 11, 2043-2047. [all data]