2,3,3',4',5,6-Hexachloro-1,1'-biphenyl

Normal alkane RI, non-polar column, isothermal

Data compiled by: NIST Mass Spectrometry Data Center, William E. Wallace, director

Column type Capillary
Active phase Apiezon L
Column length (m) 40.
Carrier gas H2
Substrate
Column diameter (mm) 0.30
Phase thickness (μm)
Temperature (C) 180.
I 2370.
ReferenceBallschmiter and Zell, 1980
Comment MSDC-RI

Normal alkane RI, non-polar column, custom temperature program

View large format table.

Column type Active phase I Reference Comment
CapillaryApolane2348.Bush, Murphy, et al., 1985He; Column length: 50. m; Column diameter: 0.25 mm; Program: 70 0C (2 min) 10 0C/min (6 min) 2 0C/min -> 250 0C
CapillaryApiezon L2367.Ballschmiter and Zell, 1980H2; Column length: 40. m; Column diameter: 0.30 mm; Program: not specified

References

Ballschmiter and Zell, 1980
Ballschmiter, K.; Zell, M., Analysis of polychlorinated biphenyls (PCB) by glass capillary gas chromatography, Fresenius Z. Anal. Chem., 1980, 302, 1, 20-31, https://doi.org/10.1007/BF00469758 . [all data]