1,1'-Biphenyl, 2,3,4,4',5-Pentachloro-

Van Den Dool and Kratz RI, non-polar column, temperature ramp

View large format table.

Column type Active phase I Reference Comment
CapillaryDB-52304.6Castello and Testini, 1996180. C @ 2. min, 3. K/min; Column length: 30. m; Column diameter: 0.32 mm; Tend: 260. C

Normal alkane RI, non-polar column, isothermal

View large format table.

Column type Active phase Temperature (C) I Reference Comment
CapillaryApiezon L180.2286.Ballschmiter and Zell, 1980H2; Column length: 40. m; Column diameter: 0.30 mm
CapillaryApiezon L180.2286.Ballschmiter and Zell, 1980H2; Column length: 40. m; Column diameter: 0.30 mm
CapillaryApiezon L180.2286.Ballschmiter and Zell, 1980H2; Column length: 40. m; Column diameter: 0.30 mm

References

Castello and Testini, 1996
Castello, G.; Testini, G., Determination of retention indices of polychlorobiphenyls by using other compounds detectable by electron-capture detection or selected polychlorobiphenyls as the reference series, J. Chromatogr. A, 1996, 741, 2, 241-249, https://doi.org/10.1016/0021-9673(96)00160-4 . [all data]

Ballschmiter and Zell, 1980
Ballschmiter, K.; Zell, M., Analysis of polychlorinated biphenyls (PCB) by glass capillary gas chromatography, Fresenius Z. Anal. Chem., 1980, 302, 1, 20-31, https://doi.org/10.1007/BF00469758 . [all data]