Trichloroacetic acid, hexadecyl ester

Van Den Dool and Kratz RI, polar column, temperature ramp

Data compiled by: NIST Mass Spectrometry Data Center, William E. Wallace, director

Column type Capillary
Active phase DB-Wax
Column length (m) 15.
Carrier gas He
Substrate
Column diameter (mm) 0.53
Phase thickness (μm) 1.
Tstart (C) 40.
Tend (C) 220.
Heat rate (K/min) 5.
Initial hold (min) 3.
Final hold (min) 30.
I 2788.
ReferencePeng, 2000
Comment MSDC-RI

References

Peng, 2000
Peng, C.T., Prediction of retention indices. V. Influence of electronic effects and column polarity on retention index, J. Chromatogr. A, 2000, 903, 1-2, 117-143, https://doi.org/10.1016/S0021-9673(00)00901-8 . [all data]