Pyridine, 2-[1-(2-bromophenyl)ethenyl]-

Gas phase ion energetics data

Data compiled as indicated in comments:
LLK - Sharon G. Lias, Rhoda D. Levin, and Sherif A. Kafafi

Ionization energy determinations

IE (eV) Method Reference Comment
8.6EISchubert and Grutzmacher, 1980LLK
8.6EIGrutzmacher, Schaldach, et al., 1980LLK

Appearance energy determinations

Ion AE (eV) Other Products MethodReferenceComment
C13H10N+9.0BrEISchubert and Grutzmacher, 1980LLK
C13H10N+9.0BrEIGrutzmacher, Schaldach, et al., 1980LLK

References

Schubert and Grutzmacher, 1980
Schubert, R.; Grutzmacher, H.-F., Kinetic energy release and position of transition state during intramolecular aromatic substitution in ionized 1-phenyl-1-(2-pyridyl)ethylenes, J. Am. Chem. Soc., 1980, 102, 5323. [all data]

Grutzmacher, Schaldach, et al., 1980
Grutzmacher, H.-F.; Schaldach, B.; Schubert, R.; Ramana, D.V., Ion kinetic energy release as a transition state probe in intramolecular aromatic substitutions, Adv. Mass Spectrom., 1980, 8, 795. [all data]