cis-Dimethyl perfluoro(4-methyl-2-pentene)dioate

Reaction thermochemistry data

Data compiled by: Hussein Y. Afeefy, Joel F. Liebman, and Stephen E. Stein

Individual Reactions

cis-Dimethyl perfluoro(4-methyl-2-pentene)dioate = 2-Pentenedioic acid, 2,3,4-trifluoro-4-(trifluoromethyl)-, dimethyl ester, (E)-

By formula: C8H6F6O4 = C8H6F6O4

Quantity Value Units Method Reference Comment
Δr-21.2kJ/molEqkPaleta, Svobdoda, et al., 1980liquid phase; solvent: Dimethylsulfoxide-Acetonitrile; GLC

References

Paleta, Svobdoda, et al., 1980
Paleta, O.; Svobdoda, J.; Havlu, V.; Dedek, V., Haloacrylic acids. XIV. Anionic cis-trans isomerization of dimethyl perfluoro(4-methyl-2-pentene)dioate, Collect. Czech. Chem. Commun., 1980, 45, 3360-3369. [all data]