2-Hydroxy-4'-trifluoromethyl-4-methoxybenzophenone

Phase change data

Data compiled by: William E. Acree, Jr., James S. Chickos

Enthalpy of sublimation

ΔsubH (kJ/mol) Temperature (K) Method Reference Comment
91.0323.EVStephenson and Malanowski, 1987Based on data from 313. - 333. K. See also Gray and Burton, 1966.

References

Stephenson and Malanowski, 1987
Stephenson, Richard M.; Malanowski, Stanislaw, Handbook of the Thermodynamics of Organic Compounds, 1987, https://doi.org/10.1007/978-94-009-3173-2 . [all data]

Gray and Burton, 1966
Gray, D.N.; Burton, Gwen, Evaporation Rates and Vapor Pressures of Some Fluoro- and Trifluoromethyl-Substituted 2-Hydroxy - 4 - Methoxybenzophenones., J. Chem. Eng. Data, 1966, 11, 1, 59-60, https://doi.org/10.1021/je60028a016 . [all data]