Stannane, tetra-2-propenyl-

Phase change data

Data compiled by: William E. Acree, Jr., James S. Chickos

Enthalpy of vaporization

ΔvapH (kcal/mol) Temperature (K) Method Reference
12.4333. - 393.GCHawker, 1992

References

Hawker, 1992
Hawker, Darryl, Equilibrium vapour pressures of tetraorganostannanes, Chemosphere, 1992, 25, 4, 427-436, https://doi.org/10.1016/0045-6535(92)90276-W . [all data]