1,8-dimethylphenanthrene

Lee's RI, non-polar column, custom temperature program

Data compiled by: NIST Mass Spectrometry Data Center, William E. Wallace, director

Column type CapillaryCapillaryCapillaryCapillary
Active phase DB-5CP Sil 8 CBCP Sil 8 CBSE-52
Column length (m) 30.50.50.
Carrier gas HeHeHe
Substrate
Column diameter (mm) 0.250.250.25
Phase thickness (μm) 0.250.250.25
Program 90C (1min) => 10C/min => 120C => 4C/min => 310C (20min)not specifiednot specifiednot specified
I 345.22346.1346.9346.26
ReferenceZamperlini, Silva, et al., 1997Bundt, Herbel, et al., 1991Bundt, Herbel, et al., 1991Shlyakhov, 1984
Comment MSDC-RI MSDC-RI MSDC-RI MSDC-RI

References

Zamperlini, Silva, et al., 1997
Zamperlini, G.C.M.; Silva, M.R.S.; Vilegas, W., Identification of polycyclic aromatic hydrocarbons in sugar cane soot by gas chromatography-mass spectrometry, Chromatographia, 1997, 46, 11/12, 655-663, https://doi.org/10.1007/BF02490527 . [all data]

Bundt, Herbel, et al., 1991
Bundt, J.; Herbel, W.; Steinhart, H.; Franke, S.; Francke, W., Structure-type separation of diesel fuels by solid phase extraction and identification of the two- and three-ring aromatics by capillary GC-mass spectrometry, J. Hi. Res. Chromatogr., 1991, 14, 2, 91-98, https://doi.org/10.1002/jhrc.1240140205 . [all data]

Shlyakhov, 1984
Shlyakhov, A.F., Gas chromatography in organic geochemistry, Nedra, Moscow, 1984, 221. [all data]