L-Proline, 2TMS derivative

Kovats' RI, non-polar column, isothermal

Data compiled by: NIST Mass Spectrometry Data Center, William E. Wallace, director

Column type CapillaryCapillary
Active phase SP-2100SE-54
Column length (m) 12.12.
Carrier gas HeHe
Substrate
Column diameter (mm) 0.20.2
Phase thickness (μm)
Temperature (C) 90.85.
I 1296.991304.19
ReferenceGajewski, Dizdaroglu, et al., 1982Gajewski, Dizdaroglu, et al., 1982
Comment MSDC-RI MSDC-RI

Van Den Dool and Kratz RI, non-polar column, custom temperature program

Data compiled by: NIST Mass Spectrometry Data Center, William E. Wallace, director

Column type Capillary
Active phase HP-5MS
Column length (m) 30.
Carrier gas He
Substrate
Column diameter (mm) 0.25
Phase thickness (μm) 0.25
Program 60C (1 min) => 5 C/min => 210C => 10 C/min => 280C (15 min)
I 1293.8
ReferenceAndriamaharavo, 2014
Comment MSDC-RI

References

Gajewski, Dizdaroglu, et al., 1982
Gajewski, E.; Dizdaroglu, M.; Simic, M.G., Kovats' Indices of Trimethylsilylated Amino Acids on Fused-Silica Capillary Columns, J. Chromatogr., 1982, 249, 1, 41-55, https://doi.org/10.1016/S0021-9673(00)80231-9 . [all data]