1,4-Methanonaphthalene,1,4-dihydro-9-((1-methylethylidene)-

Gas phase ion energetics data

Data compiled by: Sharon G. Lias, Rhoda D. Levin, and Sherif A. Kafafi

Ionization energy determinations

IE (eV) Method Reference Comment
8.01PEHaselbach and Rossi, 1976Vertical value

References

Haselbach and Rossi, 1976
Haselbach, E.; Rossi, M., 33. Electronic structure, molecular conformation and reactivity of benzonorboradiene systems, Helv. Chim. Acta, 1976, 59, 278. [all data]