Naphthalene, 1,8-bis(methylthio)-

Gas phase ion energetics data

Data compiled as indicated in comments:
LLK - Sharon G. Lias, Rhoda D. Levin, and Sherif A. Kafafi

Ionization energy determinations

IE (eV) Method Reference Comment
7.2PEBock and Brahler, 1979LLK
7.55PEBock and Brahler, 1979Vertical value; LLK

References

Bock and Brahler, 1979
Bock, H.; Brahler, U.G., Oxidation und Reduktion methylthio-substitierter Naphthaline - ein Vergleich von Molekulzustanden, Chem. Ber., 1979, 112, 3081. [all data]