Parietin, 2TMS derivative

Kovats' RI, non-polar column, temperature ramp

View large format table.

Column type Active phase I Reference Comment
CapillaryDB-12836.Lewis and Shibamoto, 1985He, 6. K/min; Column length: 15. m; Column diameter: 0.25 mm; Tstart: 200. C; Tend: 300. C

References

Lewis and Shibamoto, 1985
Lewis, D.C.; Shibamoto, T., Analysis of toxic anthraquinones and related compounds with fused silica capillary column, J. Hi. Res. Chromatogr. Chromatogr. Comm., 1985, 8, 6, 280-282, https://doi.org/10.1002/jhrc.1240080602 . [all data]