3-Butenal

Gas phase ion energetics data

Data compiled by: Sharon G. Lias and Joel F. Liebman

Ionization energy determinations

IE (eV) Method Reference
9.65ESTTakhistov and Ponomarev, 1994

References

Takhistov and Ponomarev, 1994
Takhistov, V.V.; Ponomarev, D.A., Isodesmic reactions and thermochemistry of ions, Org. Mass Spectrom., 1994, 29, 395. [all data]