2-Chlorohydrocinnamonitrile

Normal alkane RI, non-polar column, temperature ramp

Data compiled by: NIST Mass Spectrometry Data Center, William E. Wallace, director

Column type Capillary
Active phase ZB-5
Column length (m) 30.
Carrier gas He
Substrate
Column diameter (mm) 0.25
Phase thickness (μm) 0.25
Tstart (C) 40.
Tend (C) 200.
Heat rate (K/min) 10.
Initial hold (min)
Final hold (min) 2.
I 1368.
ReferenceKluchinsky, Sheely, et al., 2002
Comment MSDC-RI

References

Kluchinsky, Sheely, et al., 2002
Kluchinsky, T.A., Jr.; Sheely, M.V.; Savage, P.B.; Smith, P.A., Formation of 2-chlorobenzylidenemalononitrile (CS riot control agent) thermal degradation products at elevated temperatures, J. Chromatogr. A, 2002, 952, 1-2, 205-213, https://doi.org/10.1016/S0021-9673(02)00096-1 . [all data]