Pyrazine, 2-ethyl-3-(methylthio)-

Normal alkane RI, non-polar column, temperature ramp

Data compiled by: NIST Mass Spectrometry Data Center, William E. Wallace, director

Column type CapillaryCapillaryCapillary
Active phase OV-101OV-101OV-101
Column length (m) 50.50.50.
Carrier gas  N2N2
Substrate
Column diameter (mm) 0.220.220.22
Phase thickness (μm)
Tstart (C) 80.80.80.
Tend (C) 200.200.200.
Heat rate (K/min) 2.2.2.
Initial hold (min)
Final hold (min)
I 1237.1237.1237.
ReferenceMihara and Masuda, 1988Mihara and Masuda, 1987Mihara and Enomoto, 1985
Comment MSDC-RI MSDC-RI MSDC-RI

References

Mihara and Masuda, 1988
Mihara, S.; Masuda, H., Structure-odor relationships for disubstituted pyrazines, J. Agric. Food Chem., 1988, 36, 6, 1242-1247, https://doi.org/10.1021/jf00084a029 . [all data]

Mihara and Masuda, 1987
Mihara, S.; Masuda, H., Correlation between molecular structures and retention indices of pyrazines, J. Chromatogr., 1987, 402, 309-317, https://doi.org/10.1016/0021-9673(87)80029-8 . [all data]

Mihara and Enomoto, 1985
Mihara, S.; Enomoto, N., Calculation of retention indices of pyrazines on the basis of molecular structure, J. Chromatogr., 1985, 324, 428-430, https://doi.org/10.1016/S0021-9673(01)81342-X . [all data]