1,3,5-Tris(trifluoromethyl)benzene

Reaction thermochemistry data

Data compiled by: John E. Bartmess

Individual Reactions

C9H2F9- + Hydrogen cation = 1,3,5-Tris(trifluoromethyl)benzene

By formula: C9H2F9- + H+ = C9H3F9

Quantity Value Units Method Reference Comment
Δr1517. ± 13.kJ/molG+TSSchlosser, Mongin, et al., 1998gas phase
Quantity Value Units Method Reference Comment
Δr1482. ± 13.kJ/molIMRESchlosser, Mongin, et al., 1998gas phase

References

Schlosser, Mongin, et al., 1998
Schlosser, M.; Mongin, F.; Porwisiak, J.; Dmowski, W.; Buker, H.H.; Nibbering, N.M.M., Bis- and Oligo(trifluoromethyl)benzenes: Hydrogen/Metal Exchange Rates and Gas-Phase Acidities., Chem. Eur. J., 1998, 4, 7, 1281, https://doi.org/10.1002/(SICI)1521-3765(19980710)4:7<1281::AID-CHEM1281>3.0.CO;2-I . [all data]