Phenyl silyl radical

Gas phase ion energetics data

Data compiled as indicated in comments:
LL - Sharon G. Lias and Joel F. Liebman
B - John E. Bartmess

Electron affinity determinations

EA (eV) Method Reference Comment
1.4354 ± 0.0043LPDWetzel, Salomon, et al., 1989D-EA cycle give BDE=87.7±2.2 kcal/mol; B
1.35 ± 0.22D-EADamrauer, Kass, et al., 1988Between HF and acetone; B

Ionization energy determinations

IE (eV) Method Reference Comment
6.89DERNagano, Murthy, et al., 1993LL

References

Wetzel, Salomon, et al., 1989
Wetzel, D.M.; Salomon, K.E.; Berger, S.; Brauman, J.I., Gas-Phase Acidities of Organosilanes and Electron Affinities of Organosilyl Radicals, J. Am. Chem. Soc., 1989, 111, 11, 3835, https://doi.org/10.1021/ja00193a013 . [all data]

Damrauer, Kass, et al., 1988
Damrauer, R.; Kass, S.R.; DePuy, C.H., Gas-Phase Acidities of Methylsilanes: C-H versus Si-H, Organomet., 1988, 7, 3, 637, https://doi.org/10.1021/om00093a011 . [all data]

Nagano, Murthy, et al., 1993
Nagano, Y.; Murthy, S.; Beauchamp, J.L., Thermochemical properties and gas-phase ion chemistry of phenylsilane investigated by FT-ICR spectrometry. Identification of parent- and fragment-ion structural isomers by their specific reactivities, J. Am. Chem. Soc., 1993, 115, 10805. [all data]