Methoxychlor

Phase change data

Data compiled as indicated in comments:
TRC - Thermodynamics Research Center, NIST Boulder Laboratories, Chris Muzny director
AC - William E. Acree, Jr., James S. Chickos

Quantity Value Units Method Reference Comment
Tfus361.56KN/ADonnelly, Drewes, et al., 1990Uncertainty assigned by TRC = 0.2 K; TRC
Tfus362.7KN/APlato and Glasgow, 1969Uncertainty assigned by TRC = 0.2 K; TRC

Enthalpy of fusion

ΔfusH (kJ/mol) Temperature (K) Method Reference Comment
27.48360.6DSCDonnelly, Drewes, et al., 1990, 2AC

In addition to the Thermodynamics Research Center (TRC) data available from this site, much more physical and chemical property data is available from the following TRC products:

Kovats' RI, non-polar column, isothermal

View large format table.

Column type Active phase Temperature (C) I Reference Comment
CapillaryOV-1220.2413.Erdmann, Rochholz, et al., 1992
PackedOV-1200.2401.Dubsky, Hána, et al., 1979Column length: 2. m
PackedOV-1210.2418.Dubsky, Hána, et al., 1979Column length: 2. m

Kovats' RI, non-polar column, custom temperature program

View large format table.

Column type Active phase I Reference Comment
PackedSE-302410.Ramsey, Lee, et al., 1980He, Chromosorb G HP (80-100 mesh); Column length: 1.5 m; Program: not specified

Van Den Dool and Kratz RI, non-polar column, temperature ramp

View large format table.

Column type Active phase I Reference Comment
CapillaryOV-12439.3Gautzsch and Zinn, 19968. K/min; Tstart: 35. C; Tend: 300. C

Normal alkane RI, non-polar column, temperature ramp

View large format table.

Column type Active phase I Reference Comment
PackedOV-12420.Marozzi, Gambaro, et al., 1982Gas Chrom P, 5. K/min; Column length: 2. m; Tstart: 150. C; Tend: 300. C
PackedSE-302420.Marozzi, Gambaro, et al., 1982Gas Chrom P, 5. K/min; Column length: 2. m; Tstart: 150. C; Tend: 300. C

Normal alkane RI, non-polar column, custom temperature program

View large format table.

Column type Active phase I Reference Comment
Capillary5 % Phenyl methyl siloxane2491.Department of Food Safety and Welfare, 200630. m/0.25 mm/0.25 μm, Helium; Program: 50 0C(1 min) 25 0C/min -> 125 0C 10 0C/min -> 300 0C (10 min)
CapillaryUltra-12395.Tameo and Kiyos, 1991Program: not specified
CapillaryOV-1, SE-30, Methyl silicone, SP-2100, OV-101, DB-1, etc.2417.Waggott and Davies, 1984Hydrogen; Column length: 50. m; Column diameter: 0.32 mm; Program: not specified
CapillaryOV-1, SE-30, Methyl silicone, SP-2100, OV-101, DB-1, etc.2420.Waggott and Davies, 1984Hydrogen; Column length: 50. m; Column diameter: 0.32 mm; Program: not specified
OtherMethyl Silicone2417.Ardrey and Moffat, 1981Program: not specified

References

Donnelly, Drewes, et al., 1990
Donnelly, J.R.; Drewes, L.A.; Johnson, R.L.; Munslow, W.D.; Knapp, K.K.; Sovocool, G.W., Purity and heat of fusion data for environmental standards as determined by differential scanning calorimetry, Thermochim. Acta, 1990, 167, 2, 155, https://doi.org/10.1016/0040-6031(90)80476-F . [all data]

Plato and Glasgow, 1969
Plato, C.; Glasgow, A.R., Jr., Differential scanning calorimetry as a general method for determining the purity and heat of fusion of high-purity organic chemicals. Application to 95 compounds, Anal. Chem., 1969, 41, 2, 330, https://doi.org/10.1021/ac60271a041 . [all data]

Donnelly, Drewes, et al., 1990, 2
Donnelly, J.R.; Drewes, L.A.; Johnson, R.L.; Munslow, W.D.; Knapp, K.K.; Sovocool, G.W., Purity and heat of fusion data for environmental standards as determined by differential scanning calorimetry, Thermochimica Acta, 1990, 167, 2, 155-187, https://doi.org/10.1016/0040-6031(90)80476-F . [all data]