9-Anthracenecarboxylic acid

Phase change data

Data compiled by: William E. Acree, Jr., James S. Chickos

Enthalpy of sublimation

ΔsubH (kJ/mol) Temperature (K) Method Reference
120.1 ± 3.8385. - 420.MEGoldfarb and Suuberg, 2008

References

Goldfarb and Suuberg, 2008
Goldfarb, Jillian L.; Suuberg, Eric M., VAPOR PRESSURES AND THERMODYNAMICS OF OXYGEN-CONTAINING POLYCYCLIC AROMATIC HYDROCARBONS MEASURED USING KNUDSEN EFFUSION, Environ Toxicol Chem, 2008, 27, 6, 1244, https://doi.org/10.1897/07-486.1 . [all data]