Pentanedioic acid, 3-oxo-, tris(trimethylsilyl) ester

Normal alkane RI, non-polar column, temperature ramp

Data compiled by: NIST Mass Spectrometry Data Center, William E. Wallace, director

Column type CapillaryCapillary
Active phase HP-5MSHP-5MS
Column length (m) 30.30.
Carrier gas HeHe
Substrate
Column diameter (mm) 0.250.25
Phase thickness (μm) 0.250.25
Tstart (C) 70.70.
Tend (C) 280.280.
Heat rate (K/min) 4.4.
Initial hold (min) 3.3.
Final hold (min) 3.3.
I 1619.1631.
ReferenceLee, Yanamandra, et al., 2002Lee, Yanamandra, et al., 2002
Comment MSDC-RI MSDC-RI

References

Lee, Yanamandra, et al., 2002
Lee, B.Y.; Yanamandra, K.; Thurmon, T.F., Quantitative estimation of organic analytes with a capillary column, Am. Clin. Lab., 2002, May, 30-34. [all data]