Cyclopropane, 1,1-diethynyl-

Condensed phase thermochemistry data

Data compiled by: Hussein Y. Afeefy, Joel F. Liebman, and Stephen E. Stein

Quantity Value Units Method Reference Comment
Δfliquid500.9 ± 1.2kJ/molCcrPimenova, Kozina, et al., 1986
Quantity Value Units Method Reference Comment
Δcliquid-4113.0 ± 0.8kJ/molCcrPimenova, Kozina, et al., 1986Corresponding Δfliquid = 500.9 kJ/mol (simple calculation by NIST; no Washburn corrections)

Gas phase thermochemistry data

Data compiled by: Hussein Y. Afeefy, Joel F. Liebman, and Stephen E. Stein

Quantity Value Units Method Reference Comment
Δfgas538.5 ± 1.2kJ/molCcrPimenova, Kozina, et al., 1986

References

Pimenova, Kozina, et al., 1986
Pimenova, S.M.; Kozina, M.P.; Gal'chenko, G.L.; Siretskaya, T.V.; Takhistov, V.V.; Kuznetsova, T.S.; Proskurnina, M.V.; Kotel'nikova, T.A., Heats of combustion and formation of some compounds with acetylene bonding, Termodin. Org. Soedin., 1986, 12-16. [all data]