1,4-Ethanopyridazino[1,2-b]phthalazine,1,2,3,4,6,11-hexahydro-

Gas phase ion energetics data

Data compiled by: Sharon G. Lias, Rhoda D. Levin, and Sherif A. Kafafi

Ionization energy determinations

IE (eV) Method Reference Comment
7.21PENelsen, Hollinsed, et al., 1979Vertical value

References

Nelsen, Hollinsed, et al., 1979
Nelsen, S.F.; Hollinsed, W.C.; Grezzo, L.A.; Parmelee, W.P., Conformational effects in 2,3-cycloalkyl-2,3-diazabicyclic tetraalkylhydrazines, J. Am. Chem. Soc., 1979, 101, 7347. [all data]