2-Cyclohexen-1-ol, 1-methyl-4-(1-methylethenyl)-, trans-

Kovats' RI, non-polar column, temperature ramp

Data compiled by: NIST Mass Spectrometry Data Center, William E. Wallace, director

Column type CapillaryCapillaryCapillaryCapillaryCapillary
Active phase DB-5HP-5MSDB-5DB-5OV-101
Column length (m) 30.30.30.25.50.
Carrier gas HeHeHeHeN2
Substrate
Column diameter (mm) 0.250.250.260.250.25
Phase thickness (μm) 0.250.250.250.250.2
Tstart (C) 60.50.60.60.80.
Tend (C)  240.246.180.200.
Heat rate (K/min) 3.3.3.5.2.
Initial hold (min)    6.
Final hold (min)    15.60.
I 1123.1105.1123.1128.1111.
ReferenceLucero, Fredrickson, et al., 2006Tepe, Askin Akpulat, et al., 2006Adams, Morris, et al., 2005Merle, Morón, et al., 2004Padrayuttawat, Tamura, et al., 1996
Comment MSDC-RI MSDC-RI MSDC-RI MSDC-RI MSDC-RI

Van Den Dool and Kratz RI, non-polar column, temperature ramp

Data compiled by: NIST Mass Spectrometry Data Center, William E. Wallace, director

Column type CapillaryCapillaryCapillaryCapillaryCapillary
Active phase RTX-1BP-1HP-5HP-5DB-5
Column length (m) 60.50.30.30.30.
Carrier gas HeHeHe N2
Substrate
Column diameter (mm) 0.220.250.250.250.25
Phase thickness (μm) 0.250.250.250.250.25
Tstart (C) 60.60.60.60.60.
Tend (C) 230.220.260.220.240.
Heat rate (K/min) 2.2.3.5.3.
Initial hold (min)    10.
Final hold (min) 35.20.
I 1103.1098.1123.1126.1122.
ReferencePaolini J., Costa J., et al., 2007Bousmaha, Boti, et al., 2006Javidnia, Miri, et al., 2005Ceccarini, Macchia, et al., 2004Flamini, Cioni, et al., 2004
Comment MSDC-RI MSDC-RI MSDC-RI MSDC-RI MSDC-RI
Column type CapillaryCapillaryCapillary
Active phase DB-5OV-101OV-101
Column length (m) 30.50.50.
Carrier gas  N2N2
Substrate
Column diameter (mm) 0.320.250.25
Phase thickness (μm) 0.5
Tstart (C) 40.80.80.
Tend (C) 265.200.200.
Heat rate (K/min) 7.2.2.
Initial hold (min)
Final hold (min) 5.
I 1132.1110.1111.
ReferenceHögnadóttir and Rouseff, 2003Yang, Sugisawa, et al., 1992Yang, Sugisawa, et al., 1992
Comment MSDC-RI MSDC-RI MSDC-RI

Van Den Dool and Kratz RI, non-polar column, custom temperature program

Data compiled by: NIST Mass Spectrometry Data Center, William E. Wallace, director

Column type CapillaryCapillary
Active phase HP-5MSBPX-5
Column length (m) 30.30.
Carrier gas He
Substrate
Column diameter (mm) 0.250.25
Phase thickness (μm) 0.250.25
Program 60C (1 min) => 5 C/min => 210C => 10 C/min => 280C (15 min)35C(5min) => 3C/min => 210C => 40C/min => 240C (4min)
I 1121.91138.
ReferenceAndriamaharavo, 2014Cardeal, da Silva, et al., 2006
Comment MSDC-RI MSDC-RI

References

Lucero, Fredrickson, et al., 2006
Lucero, M.E.; Fredrickson, E.L.; Estell, R.E.; Morrison, A.A.; Richman, D.B., Volatile Composition of Gutierrezia sarothrae (Broom Snakeweed) as Determined by Steam Distillation and Solid Phase Microextraction, J. Essent. Oil Res., 2006, 18, 2, 121-125, https://doi.org/10.1080/10412905.2006.9699039 . [all data]

Tepe, Askin Akpulat, et al., 2006
Tepe, B.; Askin Akpulat, H.; Sokmen, M.; Daferera, D.; Yumrutas, O.; Aydin, E.; Polissiou, M.; Sokmen, A., Screening of the antioxidative and antimicrobial properties of the essential oils of Pimpinella anisetum and Pimpinella flabellifolia from Turkey, Food Chem., 2006, 97, 4, 719-724, https://doi.org/10.1016/j.foodchem.2005.05.045 . [all data]

Adams, Morris, et al., 2005
Adams, R.P.; Morris, J.A.; Pandey, R.N.; Schwarzbach, A.E., Cryptic speciation between Juniperus deltoides and Juniperus oxycedrus (Cupressaceae) in the Mediterranean, Biochem. Syst. Ecol., 2005, 33, 8, 771-787, https://doi.org/10.1016/j.bse.2005.01.001 . [all data]

Merle, Morón, et al., 2004
Merle, H.; Morón, M.; Blázquez, A.; Boira, H., Taxonomical contribution of essential oils in mandarins cultivars, Biochem. Syst. Ecol., 2004, 32, 5, 491-497, https://doi.org/10.1016/j.bse.2003.09.010 . [all data]

Padrayuttawat, Tamura, et al., 1996
Padrayuttawat, A.; Tamura, H.; Yamao, M., A split injection system for the analysis of purge and trap headspace of the volatile components in Citrus sudachi, J. Hi. Res. Chromatogr., 1996, 19, 6, 365-369, https://doi.org/10.1002/jhrc.1240190613 . [all data]