5-Dodecene, (Z)-

Kovats' RI, non-polar column, isothermal

View large format table.

Column type Active phase Temperature (C) I Reference Comment
CapillarySqualane100.1176.Heinzen, Soares, et al., 1999
CapillarySE-30120.1188.Gusev, Sokolov, et al., 1989H2; Column length: 40. m; Column diameter: 0.30 mm
CapillaryOV-101110.1187.Rang, Kuningas, et al., 1987He; Column length: 50. m; Column diameter: 0.25 mm
CapillarySqualane100.1176.Sojak, Hrivnak, et al., 1973
CapillarySqualane115.1177.Sojak, Hrivnak, et al., 1973
CapillarySqualane130.1178.Sojak, Hrivnak, et al., 1973
CapillarySqualane86.1175.Sojak, Hrivnak, et al., 1973
CapillaryApiezon L120.1184.2Eisen, Orav, et al., 1972Column length: 45. m; Column diameter: 0.25 mm
CapillarySqualane100.1175.6Soják and Hrivnák, 1972H2; Column length: 200. m; Column diameter: 0.2 mm
CapillarySqualane115.1176.6Soják and Hrivnák, 1972H2; Column length: 200. m; Column diameter: 0.2 mm
CapillarySqualane130.1177.5Soják and Hrivnák, 1972H2; Column length: 200. m; Column diameter: 0.2 mm
CapillarySqualane86.1174.6Soják and Hrivnák, 1972H2; Column length: 200. m; Column diameter: 0.2 mm

Kovats' RI, polar column, isothermal

View large format table.

Column type Active phase Temperature (C) I Reference Comment
CapillaryPEG 4000100.1240.Rang, Orav, et al., 1988
CapillaryPEG 4000110.1241.Rang, Orav, et al., 1988
CapillaryPEG 4000120.1242.Rang, Orav, et al., 1988
CapillaryPEG 4000140.1244.Rang, Orav, et al., 1988
CapillaryPEG 4000160.1246.Rang, Orav, et al., 1988
CapillaryPEG-20M100.1235.Rang, Orav, et al., 1988
CapillaryPEG-20M110.1235.Rang, Orav, et al., 1988
CapillaryPEG-20M120.1237.Rang, Orav, et al., 1988
CapillaryPEG-20M130.1238.Rang, Orav, et al., 1988
CapillaryPEG-20M140.1238.Rang, Orav, et al., 1988
CapillaryPEG-20M90.1233.Rang, Orav, et al., 1988
CapillaryPEG 4000100.1240.Rang, Kuningas, et al., 1977Column diameter: 0.25 mm
CapillaryPEG 4000120.1242.Rang, Kuningas, et al., 1977Column diameter: 0.25 mm
CapillaryPEG 4000140.1244.Rang, Kuningas, et al., 1977Column diameter: 0.25 mm
CapillaryPEG 4000160.1246.Rang, Kuningas, et al., 1977Column diameter: 0.25 mm
CapillaryPolyethylene Glycol 4000100.1243.1Eisen, Orav, et al., 1972Column length: 80. m; Column diameter: 0.25 mm
CapillaryPolyethylene Glycol 4000120.1244.3Eisen, Orav, et al., 1972Column length: 80. m; Column diameter: 0.25 mm
CapillaryPEG 4000100.1243.1Orav and Eisen, 1972Column length: 80. m; Column diameter: 0.25 mm
CapillaryPEG 4000120.1244.3Orav and Eisen, 1972Column length: 80. m; Column diameter: 0.25 mm

Normal alkane RI, non-polar column, custom temperature program

View large format table.

Column type Active phase I Reference Comment
CapillaryPolydimethyl siloxane1176.Junkes, Castanho, et al., 2003Program: not specified

References

Heinzen, Soares, et al., 1999
Heinzen, V.E.F.; Soares, M.F.; Yunes, R.A., Semi-empirical topological method for the prediction of the chromatographic retention of cis- and trans-alkene isomers and alkanes, J. Chromatogr. A, 1999, 849, 2, 495-506, https://doi.org/10.1016/S0021-9673(99)00530-0 . [all data]

Gusev, Sokolov, et al., 1989
Gusev, G.M.; Sokolov, V.P.; Yurov, V.V.; Kuznetsov, A.V.; Potatuev, A.A., Identification of olefins during hydrocarboxylation, Zh. Anal. Khim., 1989, 44, 551-555. [all data]

Rang, Kuningas, et al., 1987
Rang, S.; Kuningas, K.; Strenze, T.; Orav, A.; Eisen, O., Retention and Thermodynamics of Solution of n-Alkenes in OV-101, J. Chromatogr., 1987, 406, 75-80, https://doi.org/10.1016/S0021-9673(00)94018-4 . [all data]

Sojak, Hrivnak, et al., 1973
Sojak, L.; Hrivnak, J.; Majer, P.; Janak, J., Capillary Gas Chromatography of Linear Alkenes on Squalane, Anal. Chem., 1973, 45, 2, 293-302, https://doi.org/10.1021/ac60324a039 . [all data]

Eisen, Orav, et al., 1972
Eisen, O.; Orav, A.; Rang, S., Identifizierung von Normal-Alkenen, Cyclopentenen und -Hexenen mittels Kapillar-Gas-Chromatographie. Identification des alcènes, cyclopentènes et -hexènes à l'aide de la chromatogrpahie en phase gazeuse sur colonne capillaire, Chromatographia, 1972, 5, 11, 229-239, https://doi.org/10.1007/BF02270600 . [all data]

Soják and Hrivnák, 1972
Soják, L.; Hrivnák, J., Open tubular column gas chromatography of the catalytic dehydrogenation products of n-dodecane, J. Chromatogr. Sci., 1972, 10, 11, 701-704, https://doi.org/10.1093/chromsci/10.11.701 . [all data]

Rang, Orav, et al., 1988
Rang, S.A.; Orav, A.E.; Kuningas, K.R.; Meister, A.E.; Strense, T.V.; Eisen, O.G., Gas-Chromatographic Characteristics of unsaturated hydrocarbons, Academy of Sciences of Estonia SSR, Tallinn, Estonia SSR, 1988, 208. [all data]

Rang, Kuningas, et al., 1977
Rang, S.; Kuningas, K.; Orav, A.; Eisen, O., Capillary Gas Chromatography of C6-C14 n-Alkenes on Polyphenyl Ether and Polyethylene Glycol 4000, Chromatographia, 1977, 10, 2, 55-64, https://doi.org/10.1007/BF02274460 . [all data]

Orav and Eisen, 1972
Orav, A.; Eisen, O., The retention indexes for alkenes, alkynes and cyclenes on capillary columns, Izv. Akad. Nauk Est. SSR, Khim. Geol., 1972, 21, 1, 39-47. [all data]

Junkes, Castanho, et al., 2003
Junkes, B.S.; Castanho, R.D.M.; Amboni, C.; Yunes, R.A.; Heinzen, V.E.F., Semiempirical Topological Index: A Novel Molecular Descriptor for Quantitative Structure-Retention Relationship Studies, Internet Electronic Journal of Molecular Design, 2003, 2, 1, 33-49. [all data]