CAS Reg. No. 71892-04-1

Reaction thermochemistry data

Data compiled by: John E. Bartmess

Individual Reactions

(CAS Reg. No. 71892-04-1 • 4294967295sodium) + sodium = CAS Reg. No. 71892-04-1

By formula: (CAS Reg. No. 71892-04-1 • 4294967295Na) + Na = CAS Reg. No. 71892-04-1

Quantity Value Units Method Reference Comment
Δr199.9 ± 1.3kJ/molN/AMiller, Leopold, et al., 1986gas phase

References

Miller, Leopold, et al., 1986
Miller, T.M.; Leopold, D.G.; Murray, K.K.; Lineberger, W.C., Electron Affinities of the Alkali Halides and the Structure of their Negative Ions, J. Chem. Phys., 1986, 85, 5, 2368, https://doi.org/10.1063/1.451091 . [all data]