CAS Reg. No. 71564-27-7

Reaction thermochemistry data

Data compiled by: John E. Bartmess

Individual Reactions

(CAS Reg. No. 71564-27-7 • 4294967295Carbon monoxide) + Carbon monoxide = CAS Reg. No. 71564-27-7

By formula: (CAS Reg. No. 71564-27-7 • 4294967295CO) + CO = CAS Reg. No. 71564-27-7

Quantity Value Units Method Reference Comment
Δr145. ± 40.kJ/molN/ANakajima, Taguwa, et al., 1994gas phase; Vertical Detachment Energy: 3.02±0.13 eV
Δr150. ± 50.kJ/molN/AEngelking and Lineberger, 1979gas phase
Δr174. ± 10.kJ/molCIDTSunderlin, Wang, et al., 1992gas phase; Affinity: CO..Fe(CO)3-

References

Nakajima, Taguwa, et al., 1994
Nakajima, A.; Taguwa, T.; Kaya, K., Photoelectron Spectroscopy of Iron Carbonyl Cluster Anions (Fen(CO)m(-), n=1-4), Chem. Phys. Lett., 1994, 221, 5-6, 436, https://doi.org/10.1016/0009-2614(94)00301-7 . [all data]

Engelking and Lineberger, 1979
Engelking, P.C.; Lineberger, W.C., Laser photoelectron spectrometry of the negative ions of iron and iron carbonyls. Electron affinity determination for the series Fe(CO)n,n=0,1,2,3,4, J. Am. Chem. Soc., 1979, 101, 5569. [all data]

Sunderlin, Wang, et al., 1992
Sunderlin, L.S.; Wang, D.; Squires, R.R., Metal Carbonyl Bond Strengths in Fe(CO)n- and Ni(CO)n-, J. Am. Chem. Soc., 1992, 114, 8, 2788, https://doi.org/10.1021/ja00034a004 . [all data]