3(Z)-Cembrene A

Normal alkane RI, non-polar column, temperature ramp

View large format table.

Column type Active phase I Reference Comment
CapillaryHP-5MS1938.Petrovic, Ristic, et al., 200630. m/0.25 mm/0.25 μm, He, 4. K/min; Tstart: 40. C; Tend: 260. C

References

Petrovic, Ristic, et al., 2006
Petrovic, S.; Ristic, M.; Milenkovic, M.; Kukic, J.; Antic-Stankovic, J.; Niketic, M., Composition and antimicrobial activity of essential oil of Stachys plumosa Griseb., Flavour Fragr. J., 2006, 21, 2, 250-252, https://doi.org/10.1002/ffj.1570 . [all data]