Adamantan-1-carboxylic acid, methyl ester

Kovats' RI, non-polar column, isothermal

Data compiled by: NIST Mass Spectrometry Data Center, William E. Wallace, director

Column type CapillaryPackedCapillaryCapillaryCapillary
Active phase OV-101SE-30SE-30SE-30SE-30
Column length (m) 50.2.50.50.50.
Carrier gas N2 N2N2N2
Substrate  Chromosorb W (60-80 mesh)
Column diameter (mm) 0.25 0.270.270.27
Phase thickness (μm)
Temperature (C) 200.140.145.160.175.
I 1489.1431.1449.1465.1474.
ReferenceSuslov, Rudenko, et al., 1988Heintz, Gruselle, et al., 1976Burkhard, Vais, et al., 1969Burkhard, Vais, et al., 1969Burkhard, Vais, et al., 1969
Comment MSDC-RI MSDC-RI MSDC-RI MSDC-RI MSDC-RI
Column type Capillary
Active phase SE-30
Column length (m) 50.
Carrier gas N2
Substrate
Column diameter (mm) 0.27
Phase thickness (μm)
Temperature (C) 190.
I 1486.
ReferenceBurkhard, Vais, et al., 1969
Comment MSDC-RI

Gas phase ion energetics data

Data evaluated as indicated in comments:
HL - Edward P. Hunter and Sharon G. Lias

Data compiled as indicated in comments:
LLK - Sharon G. Lias, Rhoda D. Levin, and Sherif A. Kafafi
LBLHLM - Sharon G. Lias, John E. Bartmess, Joel F. Liebman, John L. Holmes, Rhoda D. Levin, and W. Gary Mallard

Quantity Value Units Method Reference Comment
Proton affinity (review)206.5kcal/molN/AHunter and Lias, 1998HL
Quantity Value Units Method Reference Comment
Gas basicity199.1kcal/molN/AHunter and Lias, 1998HL

Ionization energy determinations

IE (eV) Method Reference Comment
9.38 ± 0.03PEMiller, Koch, et al., 1973LLK

Appearance energy determinations

Ion AE (eV) Other Products MethodReferenceComment
C10H15+10. ± 0.2COOCH3PIZauer and Takhistov, 1986LBLHLM

References

Suslov, Rudenko, et al., 1988
Suslov, I.A.; Rudenko, B.A.; Arzamastsev, A.P., Capillary chromatography of adamantane derivatives, Zh. Anal. Khim., 1988, 43, 328-332. [all data]

Heintz, Gruselle, et al., 1976
Heintz, M.; Gruselle, M.; Druilhe, A.; Lefort, D., Relations entre structure chimique et données de rétention en chromatographie en phase gaseuse. VI. Alcools et esters méthyliques de structures cycliques, Chromatographia, 1976, 9, 8, 367-372, https://doi.org/10.1007/BF02330385 . [all data]

Burkhard, Vais, et al., 1969
Burkhard, J.; Vais, J.; Vodicka, L.; Landa, S., Adamantane and its derivatives. XVI. The gas chromatographic characterization of adamantane derivatives, J. Chromatogr., 1969, 42, 207-218, https://doi.org/10.1016/S0021-9673(01)80617-8 . [all data]