Tricyclo[3.2.2.02,4]nona-6,8-diene

Gas phase ion energetics data

Data compiled as indicated in comments:
LBLHLM - Sharon G. Lias, John E. Bartmess, Joel F. Liebman, John L. Holmes, Rhoda D. Levin, and W. Gary Mallard
LLK - Sharon G. Lias, Rhoda D. Levin, and Sherif A. Kafafi

Ionization energy determinations

IE (eV) Method Reference Comment
8.3PEGleiter, Bohm, et al., 1983LBLHLM
8.50PEGleiter, Bohm, et al., 1983Vertical value; LBLHLM
8.65PEBruckmann and Klessinger, 1972Vertical value; LLK

References

Gleiter, Bohm, et al., 1983
Gleiter, R.; Bohm, M.C.; de Meijere, A.; Preuss, T., Electronic structure and reactivity of homobarrelene derivatives, J. Org. Chem., 1983, 48, 796. [all data]

Bruckmann and Klessinger, 1972
Bruckmann, P.; Klessinger, M., Photoelektronenspektren ungesattigter Systeme mit Cyclopropan- und Cyclobutanringen, Angew. Chem., 1972, 84, 543. [all data]