3,5-Dimethyl-1-adamantanol

Normal alkane RI, non-polar column, custom temperature program

Data compiled by: NIST Mass Spectrometry Data Center, William E. Wallace, director

Column type Capillary
Active phase Polydimethyl siloxane
Column length (m)
Carrier gas
Substrate
Column diameter (mm)
Phase thickness (μm)
Program not specified
I 1295.
ReferenceBayat and Abad, 2011
Comment MSDC-RI

References

Bayat and Abad, 2011
Bayat, Z.; Abad, M.F.Y., Quantitative structure-property relationship (QSPR) study of Kovats retention indices of some of adamantane derivatives by the genetic algorithm amd nultiply linear regression (GA-MLR) method, Petroleum Coal, 2011, 53, 2, 132-140. [all data]