2(3H)-Furanone, 5-hexyldihydro-

Phase change data

Data compiled as indicated in comments:
AC - William E. Acree, Jr., James S. Chickos
ALS - Hussein Y. Afeefy, Joel F. Liebman, and Stephen E. Stein
DRB - Donald R. Burgess, Jr.

Quantity Value Units Method Reference Comment
Δvap75.6 ± 0.3kJ/molGSEmel'yanenko, Kozlova, et al., 2008Based on data from 298. - 365. K.; AC
Δvap63. ± 1.kJ/molVWiberg and Waldron, 1991Heat of reduction; ALS
Δvap63.0kJ/molN/AWiberg and Waldron, 1991DRB

Kovats' RI, non-polar column, isothermal

View large format table.

Column type Active phase Temperature (C) I Reference Comment
CapillarySE-30100.1431.4Tudor, 199740. m/0.35 mm/0.35 μm

Kovats' RI, non-polar column, temperature ramp

View large format table.

Column type Active phase I Reference Comment
CapillaryHP-5MS1463.Asuming, Beauchamp, et al., 200530. m/0.25 mm/0.25 μm, He, 50. C @ 10. min, 3. K/min, 250. C @ 5. min
CapillaryDB-11428.Nagalakshmi, Thangadurai, et al., 200128. m/0.25 mm/0.25 μm, He, 50. C @ 1. min, 4.5 K/min; Tend: 270. C
CapillaryDB-11419.Takeoka, Perrino, et al., 199660. m/0.25 mm/0.25 μm, 30. C @ 4. min, 2. K/min; Tend: 220. C
CapillaryDB-11423.Takeoka, Perrino, et al., 199660. m/0.25 mm/0.25 μm, 30. C @ 4. min, 2. K/min; Tend: 220. C
CapillaryDB-11428.Saad, El-Sharkawy, et al., 199528. m/0.25 mm/0.25 μm, He, 50. C @ 1. min, 4. K/min; Tend: 270. C
CapillaryDB-11422.Takeoka, Flath, et al., 199060. m/0.32 mm/0.25 μm, He, 30. C @ 4. min, 2. K/min; Tend: 210. C
CapillaryDB-11424.Takeoka, Flath, et al., 199060. m/0.32 mm/0.25 μm, He, 30. C @ 4. min, 2. K/min; Tend: 210. C
CapillaryDB-11422.Takeoka, Flath, et al., 199060. m/0.32 mm/0.25 μm, He, 30. C @ 4. min, 2. K/min; Tend: 210. C
CapillaryDB-11425.Takeoka, Flath, et al., 199060. m/0.32 mm/0.25 μm, He, 30. C @ 4. min, 2. K/min; Tend: 210. C

Kovats' RI, non-polar column, custom temperature program

View large format table.

Column type Active phase I Reference Comment
CapillarySPB-11418.Riu-Aumatell, Castellari, et al., 200430. m/0.25 mm/0.25 μm; Program: not specified

Kovats' RI, polar column, temperature ramp

View large format table.

Column type Active phase I Reference Comment
CapillarySupelcowax2101.Riu-Aumatell, Castellari, et al., 200430. m/0.25 mm/0.25 μm, 60. C @ 5. min, 3. K/min, 240. C @ 10. min
CapillaryCarbowax 20M2098.Nishimura, Yamaguchi, et al., 19892. K/min; Column length: 50. m; Column diameter: 0.22 mm; Tstart: 80. C; Tend: 200. C
CapillaryDB-Wax2113.Umano, Shoji, et al., 1986N2, 60. C @ 10. min, 2. K/min; Column length: 30. m; Column diameter: 0.25 mm; Tend: 200. C
CapillaryCarbowax 20M2151.Spencer, Pangborn, et al., 1978N2, 3. K/min; Column length: 30. m; Column diameter: 0.26 mm; Tstart: 70. C; Tend: 170. C
CapillaryCarbowax 20M2153.Spencer, Pangborn, et al., 1978N2, 3. K/min; Column length: 30. m; Column diameter: 0.26 mm; Tstart: 70. C; Tend: 170. C
CapillaryCarbowax 20M2096.Tressl, Friese, et al., 1978He, 2. K/min; Column length: 50. m; Column diameter: 0.28 mm; Tstart: 70. C; Tend: 190. C

Van Den Dool and Kratz RI, non-polar column, temperature ramp

View large format table.

Column type Active phase I Reference Comment
CapillaryDB-5MS1465.Schwambach and Peterson, 200660. m/0.25 mm/0.25 μm, H2, 30. C @ 2. min, 2. K/min, 250. C @ 2. min
CapillaryDB-5MS1490.Carunchia Whetstine, Croissant, et al., 200530. m/0.25 mm/0.25 μm, 40. C @ 3. min, 10. K/min, 200. C @ 20. min
CapillaryDB-51485.Colahan-Sederstrom and Peterson, 200530. m/0.25 mm/0.25 μm, N2, 30. C @ 2. min, 3. K/min, 250. C @ 2. min
CapillaryBPX-51486.Dickschat J.S., Wagner-Dobler I., et al., 200525. m/0.25 mm/0.25 μm, He, 50. C @ 5. min, 5. K/min; Tend: 300. C
CapillaryHP-5MS1470.Pino, Mesa, et al., 200530. m/0.25 mm/0.25 μm, He, 60. C @ 2. min, 4. K/min, 250. C @ 20. min
CapillarySPB-51494.Rodríguez-Burruezo, Kollmannsberger, et al., 200430. m/0.53 mm/1.5 μm, He, 5. K/min; Tstart: 100. C; Tend: 250. C
CapillaryDB-5MS1468.Karagül-Yüceer, Vlahovich, et al., 200330. m/0.25 mm/0.25 μm, He, 35. C @ 5. min, 10. K/min, 200. C @ 30. min
CapillaryDB-51472.Peterson and Reineccius, 200330. m/0.25 mm/0.25 μm, 35. C @ 2. min, 4. K/min, 250. C @ 4. min
CapillaryDB-11414.6Sun and Stremple, 200330. m/0.25 mm/0.25 μm, He, 3. K/min; Tstart: 40. C; Tend: 325. C
CapillaryDB-51472.Valim, Rouseff, et al., 200360. m/0.25 mm/0.25 μm, He, 7. K/min; Tstart: 40. C; Tend: 275. C
CapillaryDB-51463.Nogueira, Bittrich, et al., 200130. m/0.25 mm/0.25 μm, H2, 3. K/min; Tstart: 60. C; Tend: 240. C
CapillaryCP Sil 5 CB1431.Pino and Marbot, 200150. m/0.32 mm/0.4 μm, He, 60. C @ 10. min, 3. K/min, 280. C @ 60. min
CapillaryHP-51478.Shalit, Katzir, et al., 2001He, 50. C @ 1. min, 4. K/min; Column length: 30. m; Column diameter: 0.25 mm; Tend: 200. C
CapillaryDB-51503.Moio and Addeo, 199830. m/0.32 mm/1. μm, H2, 3. K/min; Tstart: 40. C; Tend: 210. C
CapillaryDB-51504.Moio and Addeo, 199830. m/0.32 mm/1. μm, H2, 3. K/min; Tstart: 40. C; Tend: 210. C
CapillaryDB-51476.Gómez, Ledbetter, et al., 1993He, 4. K/min; Column length: 30. m; Column diameter: 0.25 mm; Tstart: 50. C; Tend: 250. C
CapillaryDB-51474.Guichard and Souty, 1988H2, 30. C @ 5. min, 1.5 K/min; Column length: 0.32 m; Column diameter: 1. mm; Tend: 180. C

Van Den Dool and Kratz RI, non-polar column, custom temperature program

View large format table.

Column type Active phase I Reference Comment
CapillaryHP-5MS1472.6Andriamaharavo, 201430. m/0.25 mm/0.25 μm, He; Program: 60C (1 min) => 5 C/min => 210C => 10 C/min => 280C (15 min)
CapillaryDB-51470.Escudero, Campo, et al., 2007Program: not specified
CapillarySE-541462.Frauendorfer and Schieberle, 200625. m/0.32 mm/0.25 μm, He; Program: 40C(1min) => 40C/min => 60C(1min) => 4C/min => 140C => 20C/min => 240C(5min)
CapillaryDB-51465.Sampaio and Nogueira, 200630. m/0.25 mm/0.25 μm; Program: 40C(2min) => 4C/min => 220C => 20C/min => 280C
CapillaryDB-51472.Wang, Finn, et al., 200530. m/0.32 mm/1. μm, He; Program: 40C(2min) => 5C/min => 100C => 4C/min => 230C (10min)
CapillaryDB-51470.Wang, Finn, et al., 200530. m/0.32 mm/1. μm, He; Program: 40C(2min) => 5C/min => 100C => 4C/min => 230C (10min)
CapillaryHP-51467.Isidorov, Krajewska, et al., 200130. m/0.25 mm/0.25 μm, He; Program: 50C => 6C/min => 100C => 4C/min => 280C
CapillaryDB-5MS1450.Boulanger and Crouzet, 200030. m/0.25 mm/0.25 μm, He; Program: 60 0C (3 min) 2 K/min -> 220 0C 5 K/min -> 250 0C (15 min)
CapillarySE-541472.Derail, Hofmann, et al., 199930. m/0.32 mm/0.25 μm, He; Program: 35C (2min) => 40C/min => 50C => 4C/min => 230C (10min)
CapillarySE-541470.Mutti and Grosch, 199960. m/0.32 mm/0.25 μm, He; Program: 40C(2min) => 5C/min => 70C(2min) => 6C/min => 250C(10min)

Van Den Dool and Kratz RI, polar column, temperature ramp

View large format table.

Column type Active phase I Reference Comment
CapillaryDB-Wax Etr2144.Aubert and Chanforan, 200730. m/0.25 mm/0.25 μm, 40. C @ 3. min, 5. K/min, 250. C @ 15. min
CapillaryDB-Wax2136.Pozo-Bayon M.A., Ruiz-Rodriguez A., et al., 200730. m/0.25 mm/0.5 μm, He, 40. C @ 5. min, 4. K/min, 250. C @ 15. min
CapillaryDB-Wax2136.Pozo-Bayon M.A., Ruiz-Rodriguez A., et al., 200730. m/0.25 mm/0.5 μm, He, 40. C @ 5. min, 4. K/min, 250. C @ 15. min
CapillaryDB-Wax Etr2144.Aubert C. and Pitrat M., 200630. m/0.25 mm/0.25 μm, He, 40. C @ 3. min, 5. K/min, 250. C @ 15. min
CapillaryDB-Wax2126.Osorio, Alarcon, et al., 200630. m/0.25 mm/0.25 μm, He, 50. C @ 4. min, 4. K/min, 220. C @ 20. min
CapillaryDB-Wax2149.Schwambach and Peterson, 200660. m/0.25 mm/0.25 μm, H2, 30. C @ 2. min, 3. K/min, 230. C @ 4. min
CapillaryDB-Wax2103.Carunchia Whetstine, Croissant, et al., 200530. m/0.25 mm/0.25 μm, 40. C @ 3. min, 10. K/min, 200. C @ 20. min
CapillaryDB-FFAP2139.Colahan-Sederstrom and Peterson, 200530. m/0.25 mm/0.25 μm, N2, 30. C @ 2. min, 3. K/min, 250. C @ 2. min
CapillarySupelcowax-102142.Riu-Aumatell, Lopez-Tamames, et al., 200530. m/0.25 mm/0.25 μm, He, 60. C @ 5. min, 3. K/min, 240. C @ 10. min
CapillaryDB-FFAP2137.Avsar, Karagul-Yuceer, et al., 200415. m/0.32 mm/0.25 μm, He, 35. C @ 5. min, 10. K/min, 225. C @ 15. min
CapillaryZB-Wax2138.Ledauphin, Saint-Clair, et al., 200430. m/0.25 mm/0.15 μm, He, 35. C @ 5. min, 5. K/min, 220. C @ 10. min
CapillaryDB-Wax2143.Mahajan, Goddik, et al., 200430. m/0.25 mm/0.5 μm, He, 40. C @ 2. min, 5. K/min, 230. C @ 10. min
CapillaryDB-Wax Etr2131.Ménager, Jost, et al., 200430. m/0.25 mm/0.25 μm, He, 40. C @ 3. min, 3. K/min, 245. C @ 20. min
CapillaryDB-Wax2136.Aubert, Günata, et al., 200330. m/0.32 mm/0.5 μm, 40. C @ 3. min, 2. K/min, 245. C @ 20. min
CapillaryDB-Wax2136.Aubert, Günata, et al., 200330. m/0.32 mm/0.5 μm, 40. C @ 3. min, 2. K/min, 245. C @ 20. min
CapillaryDB-FFAP2136.Karagül-Yüceer, Vlahovich, et al., 200330. m/0.25 mm/0.25 μm, He, 35. C @ 5. min, 10. K/min, 200. C @ 30. min
CapillarySupelcowax-102153.Moreira, Trugo, et al., 200230. m/0.25 mm/0.25 μm, He, 3. K/min, 230. C @ 30. min; Tstart: 50. C
CapillaryAT-Wax2116.Pino and Marbot, 200160. m/0.32 mm/0.25 μm, He, 65. C @ 10. min, 2. K/min, 250. C @ 60. min
CapillaryDB-Wax2185.Shimoda, Yoshimura, et al., 200160. m/0.25 mm/0.25 μm, He, 2. K/min, 230. C @ 60. min; Tstart: 50. C
CapillarySupelcowax-102151.Chung, 199960. m/0.25 mm/0.25 μm, He, 35. C @ 5. min, 2. K/min, 195. C @ 90. min
CapillaryDB-Wax2158.Sumitani, Suekane, et al., 1994He, 40. C @ 5. min, 3. K/min; Column length: 60. m; Column diameter: 0.25 mm; Tend: 200. C
CapillaryDB-Wax2127.Umano, Hagi, et al., 1992He, 40. C @ 10. min, 2. K/min; Column length: 30. m; Column diameter: 0.25 mm; Tend: 200. C
CapillaryDB-Wax2135.Fröhlich, Duque, et al., 198930. m/0.25 mm/0.25 μm, He, 50. C @ 3. min, 4. K/min; Tend: 250. C
CapillaryDB-Wax2138.Fröhlich, Duque, et al., 198930. m/0.25 mm/0.25 μm, He, 50. C @ 3. min, 4. K/min; Tend: 250. C
CapillaryCarbowax 20M2110.Chen, Kuo, et al., 1986He, 50. C @ 5. min, 2. K/min, 200. C @ 40. min; Column length: 50. m; Column diameter: 0.32 mm

Van Den Dool and Kratz RI, polar column, custom temperature program

View large format table.

Column type Active phase I Reference Comment
CapillaryDB-Wax2179.Escudero, Campo, et al., 200730. m/0.32 mm/0.5 μm, H2; Program: 40C(5min) => 4C/min => 100C6C/min => 136C => 3C/min => 220C (10min)
CapillaryFFAP2140.Frauendorfer and Schieberle, 200625. m/0.32 mm/0.2 μm, He; Program: 40C(1min) => 40C/min => 60C(1min) => 6C/min => 180C => 15C/min => 240C
CapillaryDB-Wax2106.Guillot, Peytavi, et al., 200630. m/0.25 mm/0.25 μm, He; Program: 60C => 5C/min => 200C => 6C/min => 250C(5min)
CapillaryStabilwax2149.Wang, Finn, et al., 200530. m/0.32 mm/1. μm, He; Program: 40C(2min) => 5C/min => 100C => 4C/min => 230C (10min)
CapillaryFFAP2140.Derail, Hofmann, et al., 199930. m/0.32 mm/0.25 μm, He; Program: 35C (2min) => 40C/min => 60C => 4C/min => 230C (10min)
CapillaryFFAP2140.Derail, Hofmann, et al., 199930. m/0.32 mm/0.25 μm, He; Program: 35C (2min) => 40C/min => 60C => 4C/min => 230C (10min)
CapillaryDB-FFAP2138.Mutti and Grosch, 199930. m/0.32 mm/0.25 μm, He; Program: 40C(2min) => 40C/min => 60C(2min) => 6C/min => 230C(10min)

Normal alkane RI, non-polar column, temperature ramp

View large format table.

Column type Active phase I Reference Comment
CapillaryHP-5 MS1472.Lazarevic, Radulovic, et al., 201030. m/0.25 mm/0.25 μm, Helium, 5. K/min; Tstart: 70. C; Tend: 290. C
CapillaryDB-51472.Gogus, Ozel, et al., 200760. m/0.32 mm/1.0 μm, Helium, 35. C @ 7. min, 15. K/min, 240. C @ 10. min
CapillaryDB-51468.Zeller and Rychlik, 200725. m/0.32 mm/0.25 μm, He, 40. C @ 1. min, 6. K/min; Tend: 230. C
CapillaryDB-11448.Velasco-Negueruela, Pérez-Alonso, et al., 200650. m/0.25 mm/0.25 μm, N2, 4. K/min; Tstart: 90. C; Tend: 240. C
CapillaryDB-51467.Lin, Rouseff, et al., 200230. m/0.32 mm/0.25 μm, He, 7. K/min; Tstart: 40. C; Tend: 290. C
CapillaryDB-5MS1467.Suriyaphan, Drake, et al., 200130. m/0.32 mm/0.25 μm, He, 40. C @ 5. min, 5. K/min, 195. C @ 40. min
CapillarySPB-11416.Vijayanand, Rao, et al., 200130. m/0.32 mm/0.25 μm, He, 2. K/min; Tstart: 50. C; Tend: 250. C
CapillaryOV-1011423.Tamura, Boonbumrung, et al., 2000Nitrogen, 40. C @ 10. min, 2. K/min; Column length: 50. m; Column diameter: 0.25 mm; Tend: 200. C
CapillaryBP-51475.Lopez, Ferreira, et al., 199950. m/0.32 mm/1. μm, He, 40. C @ 5. min, 2. K/min; Tend: 190. C
CapillaryDB-5 MS1466.Suriyaphan, Drake, et al., 199960. m/0.32 mm/0.25 μm, Helium, 40. C @ 5. min, 3. K/min, 200. C @ 30. min
CapillaryHP-11418.Ong and Acree, 19984. K/min; Column length: 25. m; Column diameter: 0.32 mm; Tstart: 35. C; Tend: 250. C
CapillaryHP-11418.Ong, Acree, et al., 19984. K/min; Column length: 25. m; Column diameter: 0.32 mm; Tstart: 35. C; Tend: 250. C
CapillaryDB-5 MS1476.Gomez and Ledbetter, 1994Helium, 4. K/min; Column length: 30. m; Column diameter: 0.25 mm; Tstart: 50. C; Tend: 250. C
CapillaryUltra-21487.King, Hamilton, et al., 199350. m/0.32 mm/0.52 μm, He, 40. C @ 3. min, 4. K/min, 250. C @ 30. min
CapillaryDB-11429.Peppard, 199230. m/0.25 mm/1.0 μm, He, 3. K/min, 250. C @ 30. min; Tstart: 40. C
CapillaryDB-11429.Peppard, 199230. m/0.25 mm/1.0 μm, He, 3. K/min, 250. C @ 30. min; Tstart: 40. C
CapillaryDB-11422.Engel, Flath, et al., 198860. m/0.315 mm/0.25 μm, He, 4. K/min; Tstart: 50. C; Tend: 250. C

Normal alkane RI, non-polar column, custom temperature program

View large format table.

Column type Active phase I Reference Comment
CapillaryCP-Sil 5 CB1435.Collin, Nizet, et al., 201250. m/0.32 mm/1.20 μm, Nitrogen; Program: 36 0C 20 0C/min -> 85 0C 1 0C/min -> 145 0C 3 0C/min -> 250 0C (30 min)
CapillaryPolydimethyl siloxane with 5 % Ph groups1470.Robinson, Adams, et al., 2012Program: not specified
CapillaryPolydimethyl siloxane with 5 % Ph groups1477.Robinson, Adams, et al., 2012Program: not specified
CapillaryCP-Sil 5 CB1430.Bailly, Jerkovic, et al., 200950. m/0.32 mm/1.20 μm, Nitrogen; Program: 36 0C 20 0C/min -> 85 0C 1 0C -> 145 0C 3 0C/min -> 250 0C
CapillaryCP-Sil 5 Cb1428.Collin, Nizet, et al., 200850. m/0.32 mm/1.20 μm, Nitrogen; Program: 40 0C 20 0C/min -> 85 0C 1 0C/min -> 145 0C 3 0C/min -> 250 0C (30 min)
CapillarySE-541462.Frauendorfer and Schieberle, 2008Helium; Program: not specified
CapillaryDB-51470.Buettner, 200730. m/0.32 mm/0.25 μm; Program: 40C(2min) => 40C/min => 60C(2min) => 6C/min => 180C => 15C/min => 230C(10min)
CapillaryHP-51454.Riu-Aumatell, Lopez-Tamames, et al., 2005Program: not specified
CapillaryDB-51475.Tokitomo, Steihaus, et al., 200530. m/0.32 mm/0.25 μm, Helium; Program: 40 0C (2 min) 40 0C/min -> 60 0C (2 min) 6 0C/min -> 180 0C 10 0C/min -> 240 0C (5 min)
CapillarySE-301437.Vinogradov, 2004Program: not specified
CapillaryOV-1011437.Krings, Banavara, et al., 2003Program: not specified
CapillaryHP-5MS1439.Martí, Mestres, et al., 200330. m/0.25 mm/0.25 μm, He; Program: 40C(5min) => 2C/min => 120C => 10C/min => 210C (30min)
CapillaryMFE-731437.Ferreira, Ortín, et al., 2002H2; Program: not specified
CapillaryHP-11429.Teai, Claude-Lafontaine, et al., 200150. m/0.32 mm/0.52 μm, N2; Program: 40C => 2C/min => 130C => 4C/min => 250C
CapillarySE-541445.Lizárraga-Guerra, Guth, et al., 1997He; Column length: 30. m; Column diameter: 0.32 mm; Program: 35C => 40C/min => 60C (1min) => 6C/min => 250C
CapillarySE-541470.Schermann and Schieberle, 199730. m/0.32 mm/0.25 μm, He; Program: 35C (2min) => 40C/min => 60C (2min) => 6C/min => 180C => 10C/min => 240C
CapillarySE-541470.Schermann and Schieberle, 199730. m/0.32 mm/0.25 μm, He; Program: 35C (2min) => 40C/min => 60C (2min) => 6C/min => 180C => 10C/min => 240C

Normal alkane RI, polar column, temperature ramp

View large format table.

Column type Active phase I Reference Comment
CapillaryCarbowax 20M2183.Kafkas and Paydas, 200725. m/0.25 mm/0.40 μm, Helium, 5. K/min, 260. C @ 40. min; Tstart: 60. C
CapillaryDB-FFAP2131.Zeller and Rychlik, 200730. m/0.32 mm/0.25 μm, He, 40. C @ 1. min, 6. K/min; Tend: 230. C
CapillaryDB-Wax2110.Fan and Qian, 200630. m/0.32 mm/0.25 μm, He, 40. C @ 2. min, 4. K/min, 230. C @ 15. min
CapillaryDB-Wax Etr2141.Ibarz, Ferreira, et al., 200660. m/0.25 mm/0.25 μm, He, 40. C @ 5. min, 2. K/min, 230. C @ 100. min
CapillaryDB-Wax2175.Culleré, Escudero, et al., 200430. m/0.32 mm/0.5 μm, H2, 40. C @ 5. min, 4. K/min; Tend: 200. C
CapillaryDB-Wax2177.López, Ezpeleta, et al., 200460. m/0.25 mm/0.25 μm, He, 40. C @ 5. min, 3. K/min; Tend: 220. C
CapillaryDB-Wax2185.López, Ortín, et al., 200330. m/0.32 mm/0.5 μm, H2, 40. C @ 5. min, 4. K/min; Tend: 200. C
CapillaryCarbowax 20M2144.Saura, LAencina, et al., 2003Helium, 50. C @ 2. min, 4. K/min; Column length: 50. m; Column diameter: 0.70 mm; Tend: 280. C
CapillaryDB-Wax2178.Ferreira, Ortín, et al., 200230. m/0.32 mm/0.5 μm, H2, 40. C @ 5. min, 4. K/min; Tend: 200. C
CapillaryDB-Wax2152.Lin, Rouseff, et al., 200230. m/0.32 mm/0.5 μm, He, 7. K/min, 240. C @ 5. min; Tstart: 40. C
CapillaryDB-Wax2132.Umano, Hagi, et al., 200260. m/0.25 mm/0.25 μm, He, 40. C @ 2. min, 2. K/min; Tend: 200. C
CapillaryDB-Wax2165.Aznar, López, et al., 200130. m/0.32 mm/0.5 μm, H2, 40. C @ 5. min, 4. K/min, 200. C @ 60. min
CapillaryEC-10002145.Bendall, 200130. m/0.25 mm/0.25 μm, He, 35. C @ 5. min, 5. K/min, 230. C @ 15. min
CapillaryFFAP2126.Ducruet, Fournier, et al., 200130. m/0.32 mm/0.25 μm, H2, 40. C @ 5. min, 3. K/min; Tend: 240. C
CapillaryDB-Wax2165.Ferreira, Aznar, et al., 200130. m/0.32 mm/0.5 μm, H2, 40. C @ 5. min, 4. K/min, 200. C @ 60. min
CapillaryTC-Wax2160.Miyazawa, Kurose, et al., 2001He, 4. K/min, 250. C @ 47. min; Column length: 60. m; Column diameter: 0.25 mm; Tstart: 80. C
CapillaryDB-FFAP2152.Suriyaphan, Drake, et al., 200130. m/0.32 mm/0.25 μm, He, 40. C @ 5. min, 5. K/min, 195. C @ 40. min
CapillaryDB-Wax2125.Weckerle, Bastl-Borrmann, et al., 200130. m/0.25 mm/0.25 μm, He, 50. C @ 3. min, 4. K/min; Tend: 220. C
CapillaryDB-Wax2127.Morales, Duque, et al., 200025. m/0.25 mm/0.25 μm, He, 50. C @ 4. min, 4. K/min, 200. C @ 10. min
CapillaryDB-Wax2164.Morales, Duque, et al., 200025. m/0.25 mm/0.25 μm, He, 50. C @ 4. min, 4. K/min, 200. C @ 10. min
CapillaryDB-Wax2162.Tamura, Boonbumrung, et al., 2000Nitrogen, 40. C @ 10. min, 2. K/min; Column length: 60. m; Column diameter: 0.25 mm; Tend: 200. C
CapillaryCarbowax 20M2130.Lopez, Ferreira, et al., 199960. m/0.32 mm/0.5 μm, He, 40. C @ 5. min, 2. K/min; Tend: 190. C
CapillaryDB-Wax2165.Suriyaphan, Drake, et al., 199930. m/0.33 mm/0.25 μm, Helium, 40. C @ 5. min, 6. K/min, 200. C @ 30. min
CapillaryCarbowax 20M2130.Ferreira, Lopez, et al., 199860. m/0.32 mm/0.5 μm, He, 40. C @ 5. min, 2. K/min; Tend: 190. C
CapillarySupelcowax2178.Näf and Velluz, 1998He, 5. K/min; Column length: 60. m; Column diameter: 0.25 mm; Tstart: 80. C; Tend: 240. C
CapillaryHP-Innowax2109.Ong and Acree, 19984. K/min; Column length: 25. m; Column diameter: 0.32 mm; Tstart: 35. C; Tend: 250. C
CapillaryHP-Innowax2109.Ong, Acree, et al., 19984. K/min; Column length: 25. m; Column diameter: 0.32 mm; Tstart: 35. C; Tend: 250. C
CapillaryHP-Innowax2123.Ulrich, Hoberg, et al., 199760. m/0.32 mm/0.5 μm, H2, 1.5 K/min; Tstart: 50. C; Tend: 180. C
CapillaryTC-Wax2170.Shuichi, Masazumi, et al., 199680. C @ 5. min, 3. K/min; Column length: 60. m; Column diameter: 0.25 mm; Tend: 240. C
CapillaryDB-Wax2142.Engel, Flath, et al., 198860. m/0.322 mm/0.25 μm, He, 4. K/min; Tstart: 50. C; Tend: 230. C
CapillaryDB-Wax2129.Takeoka, Flath, et al., 198860. m/0.25 mm/0.25 μm, H2, 30. C @ 2. min, 2. K/min; Tend: 180. C
CapillaryDB-Wax2131.Takeoka, Flath, et al., 198860. m/0.25 mm/0.25 μm, H2, 30. C @ 2. min, 2. K/min; Tend: 180. C

Normal alkane RI, polar column, custom temperature program

View large format table.

Column type Active phase I Reference Comment
CapillaryDB-Wax2138.Welke, Manfroi, et al., 201230. m/0.25 mm/0.25 μm, Helium; Program: not specified
CapillaryDB-Wax2145.Welke, Manfroi, et al., 201230. m/0.25 mm/0.25 μm, Helium; Program: not specified
CapillaryDB-Wax2094.Parker, Tsormpatsidis, et al., 2010Program: not specified
CapillaryFFAP2139.Bailly, Jerkovic, et al., 200925. m/0.32 mm/0.30 μm, Nitrogen; Program: 36 0C 20 0C/min -> 85 0C 1 0C -> 145 0C 3 0C/min -> 230 0C
CapillaryDB-Wax2141.Loscos, Hernandez-Orte, et al., 200960. m/0.25 mm/0.50 μm, Helium; Program: 40 0C (3 min) 10 0C/min -> 90 0C 2 0C/min -> 230 0C (37 min)
CapillaryFFAP2100.Frauendorfer and Schieberle, 2008Helium; Program: not specified
CapillaryDB-FFAP2137.Buettner, 200730. m/0.32 mm/0.25 μm; Program: 40C(2min) => 40C/min => 60C(2min) => 6C/min => 180C => 15C/min => 230C(10min)
CapillaryDB-Wax2131.Gonzalez-Rios, Suarez-Quiroz, et al., 200730. m/0.25 mm/0.25 μm, Hydrogen; Program: 44 0C 3 0C/min -> 170 0C 8 0C/min -> 250 0C
CapillaryDB-Wax2103.Gonzalez-Rios, Suarez-Quiroz, et al., 200730. m/0.25 mm/0.25 μm, Hydrogen; Program: not specified
CapillaryDB-Wax Etr2141.Loskos, Hernandez-Orte, et al., 200760. m/0.25 mm/0.5 μm, He; Program: 40C(3min) => 10C/min => 90C => 2C/min => 230C (37min)
CapillaryHP Innowax FSP2183.Tabanca N., Demirci B., et al., 200760. m/0.25 mm/0.25 μm, N2; Program: 60C(10min) => 4C/min => 220C(10min) => 1C/min => 240C
CapillaryHP-Innowax2100.Quijano and Pino, 200660. m/0.25 mm/0.25 μm, Nitrogen; Program: 50 0C (4 min) -> 40 0C 4 0C/min -> 220 0C
CapillaryDB-FFAP2137.Buettner and Mestres, 200530. m/0.32 mm/0.25 μm; Program: 35C(2min) => 40C/min => 60C(2min) => 6C/min => 180C => 10C/min=230C(10min)
CapillaryCP-Wax 58CB2131.Tokitomo, Steihaus, et al., 200525. m/0.32 mm/0.20 μm, Helium; Program: 40 0C (2 min) 40 0C/min -> 60 0C (1 min) 6 0C/min -> 180 0C 10 0C/min -> 240 0C (5 min)
CapillaryCarbowax 20M2101.Vinogradov, 2004Program: not specified
CapillaryCarbowax 20M2101.Krings, Banavara, et al., 2003Program: not specified
CapillaryCP-WAX 57CB2173.Martí, Mestres, et al., 200350. m/0.25 mm/0.2 μm, He; Program: 40C(10min) => 5C/min => 100C => 3C/min => 180C => 20C/min => 210C (10min)
CapillaryCarbowax 20M2130.Saura, LAencina, et al., 2003Helium; Column length: 50. m; Column diameter: 0.70 mm; Program: not specified
CapillaryCarbowax 20M2090.Teai, Claude-Lafontaine, et al., 200150. m/0.2 mm/0.2 μm, N2; Program: 60C => 2C/min => 150C => 4C/min => 220C
CapillaryFFAP2125.Lambert, Demazeau, et al., 199930. m/0.32 mm/0.25 μm; Program: not specified
CapillaryFFAP2155.Schermann and Schieberle, 199730. m/0.32 mm/0.25 μm, He; Program: 35C (2min) => 40C/min => 60C (2min) => 6C/min => 180C => 10C/min => 240C
CapillaryFFAP2155.Schermann and Schieberle, 199730. m/0.32 mm/0.25 μm, He; Program: 35C (2min) => 40C/min => 60C (2min) => 6C/min => 180C => 10C/min => 240C

Condensed phase thermochemistry data

Data compiled by: Hussein Y. Afeefy, Joel F. Liebman, and Stephen E. Stein

Quantity Value Units Method Reference Comment
Δfliquid-133.7 ± 0.5kcal/molCmWiberg and Waldron, 1991Heat of reduction

References

Emel'yanenko, Kozlova, et al., 2008
Emel'yanenko, Vladimir N.; Kozlova, Svetlana A.; Verevkin, Sergey P.; Roganov, Gennady N., Vapour pressures and enthalpies of vapourization of a series of the «947»-lactones, The Journal of Chemical Thermodynamics, 2008, 40, 6, 911-916, https://doi.org/10.1016/j.jct.2008.02.002 . [all data]

Wiberg and Waldron, 1991
Wiberg, K.B.; Waldron, R.F., Lactones. 2. Enthalpies of hydrolysis, reduction, and formation of the C4-C13 monocyclic lactones. strain energies and conformations, J. Am. Chem. Soc., 1991, 113, 7697-7705. [all data]